program: Orca
programVersion: 5.0.2
elementType: Cl Cl O O O N C C C C C C C C C C C C C C C C C C C C C C H H H H H H H H H H H H H H H H H H H
charge: 0
multiplicity: 1
keywords: wb97x-d3
keywords: def2-TZVPP
keywords: def2/J RIJCOSX
keywords: DEFGRID2
keywords: scfconv7
keywords: smallprint printgap noloewdin
keywords: NOSOSCF
formula: C22H19Cl2NO3
InChI: InChI=1/C22H19Cl2NO3/c1-22(2)17(12-19(23)24)20(22)21(26)28-18(13-25)14-7-6-10-16(11-14)27-15-8-4-3-5-9-15/h3-12,17-18,20H,1-2H3
47 atoms
Cl -4.486593 -0.93948 -1.372728
Cl -4.322914 -2.448682 -3.824624
O  1.617726 -1.774895 0.167811
O  -0.186764 -0.847019 1.106952
O  1.495532 3.970786 0.082798
N  4.789035 -1.926659 1.071164
C  -1.333072 -3.708953 0.264524
C  -1.938286 -2.57978 -0.519782
C  -0.431934 -2.689776 -0.405945
C  -1.516882 -3.696713 1.761544
C  -1.301422 -5.101663 -0.31591
C  -2.569661 -2.784884 -1.828638
C  0.295087 -1.671013 0.373733
C  -3.644439 -2.143531 -2.270343
C  2.446073 -0.80344 0.802773
C  2.538325 0.457299 -0.022075
C  3.754732 -1.444549 0.943893
C  1.984609 1.63141 0.470252
C  3.130162 0.421175 -1.279313
C  2.045005 2.786698 -0.301381
C  3.170306 1.577825 -2.041279
C  2.636424 2.761544 -1.55784
C  1.311514 4.26785 1.40825
C  2.345223 4.162155 2.33035
C  0.066989 4.748295 1.786531
C  2.115892 4.533139 3.64705
C  -0.144352 5.128224 3.10466
C  0.874307 5.01584 4.040188
H  -2.376345 -1.798566 0.090816
H  0.102195 -3.057245 -1.27512
H  -0.671994 -4.176286 2.259571
H  -2.415371 -4.258325 2.024008
H  -1.629202 -2.696165 2.174388
H  -2.263304 -5.597765 -0.172794
H  -0.541755 -5.701189 0.18841
H  -1.071318 -5.119379 -1.380455
H  -2.128464 -3.512311 -2.499493
H  2.087032 -0.577826 1.811452
H  1.510518 1.634164 1.44375
H  3.560303 -0.495158 -1.664935
H  3.630055 1.562998 -3.020555
H  2.673816 3.665709 -2.152348
H  3.320335 3.799585 2.028925
H  -0.726337 4.82899 1.053828
H  2.919092 4.450095 4.367834
H  -1.114664 5.506666 3.399308
H  0.704281 5.306186 5.068571
elementType: Cl O N C H
totalener: -2050.68683048 hartree
nucrepener: 2710.56614346 hartree
electener: -4761.25297395 hartree
oneelecener: -8196.70529029 hartree
twoeener: 3435.45231634 hartree
cpcmener: -0.03055530 hartree
kineticenergy: 2044.46560713 hartree
xcener: -151.861906851161 hartree
chargesum: 0.0000000
charge: -0.055370 -0.060175 -0.276408 -0.445592 -0.323405 -0.088755 0.081988 0.024617 -0.080482 -0.259798 -0.266089 -0.202970 0.403319 0.044074 0.398260 -0.012671 -0.221296 -0.166658 -0.222579 0.286977 -0.122406 -0.233324 0.281123 -0.199898 -0.238882 -0.138390 -0.122709 -0.179616 0.078571 0.099616 0.100127 0.098728 0.093711 0.102302 0.098943 0.091629 0.128897 0.136300 0.139012 0.144294 0.158918 0.147219 0.157336 0.146436 0.159352 0.157568 0.158155
qa: -0.0554 -0.0602 -0.2764 -0.4456 -0.3234 -0.0888 0.0820 0.0246 -0.0805 -0.2598 -0.2661 -0.2030 0.4033 0.0441 0.3983 -0.0127 -0.2213 -0.1667 -0.2226 0.2870 -0.1224 -0.2333 0.2811 -0.1999 -0.2389 -0.1384 -0.1227 -0.1796 0.0786 0.0996 0.1001 0.0987 0.0937 0.1023 0.0989 0.0916 0.1289 0.1363 0.1390 0.1443 0.1589 0.1472 0.1573 0.1464 0.1594 0.1576 0.1582
va: 1.2701 1.2444 2.1379 2.0676 2.0888 3.1102 3.7599 3.8614 3.8219 3.9092 3.9073 3.9064 4.2068 4.2120 3.7381 3.6509 4.0659 3.9075 3.9937 3.7435 3.9159 4.0125 3.6871 3.9325 4.0159 3.8836 3.8833 3.9047 1.0517 1.0309 1.0000 1.0005 1.0169 1.0005 1.0016 1.0057 1.0195 1.0199 1.0191 1.0087 0.9897 1.0064 0.9963 1.0073 0.9899 0.9894 0.9905
dispcorr: -0.022845630 hartree
energy: -2050.709676111276
dipole: 17.21402 -17.64751 -0.43350 -1.24638 0.81988 -0.42651 20.22110 -20.06779 0.15330
magnitude: 0.62716 au
magnitude: 1.59412 debye
