program: Orca
programVersion: 5.0.2
elementType: Cl Cl O O O N C C C C C C C C C C C C C C C C C C C C C C H H H H H H H H H H H H H H H H H H H
charge: 0
multiplicity: 1
keywords: wb97x-d3
keywords: def2-TZVPP
keywords: def2/J RIJCOSX
keywords: DEFGRID2
keywords: scfconv7
keywords: smallprint printgap noloewdin
keywords: NOSOSCF
formula: C22H19Cl2NO3
InChI: InChI=1/C22H19Cl2NO3/c1-22(2)17(12-19(23)24)20(22)21(26)28-18(13-25)14-7-6-10-16(11-14)27-15-8-4-3-5-9-15/h3-12,17-18,20H,1-2H3
47 atoms
Cl -1.33724 -0.81205 -2.46501
Cl -3.282142 -2.239162 -4.056378
O  1.361339 -1.948983 0.286107
O  -0.292844 -1.114553 1.534406
O  0.407208 3.692464 0.32322
N  4.657002 -1.660077 0.312248
C  -1.788136 -3.763411 0.715362
C  -2.203799 -2.623044 -0.144978
C  -0.726923 -2.919924 0.024536
C  -1.996403 -3.671019 2.206376
C  -1.927296 -5.166182 0.175836
C  -2.830989 -2.804155 -1.47222
C  0.087343 -1.910277 0.714277
C  -2.523972 -2.056078 -2.523178
C  2.196475 -0.86742 0.692363
C  1.885208 0.371079 -0.11349
C  3.568682 -1.325172 0.462153
C  1.352872 1.479733 0.5281
C  2.051077 0.35945 -1.493937
C  0.992512 2.591898 -0.223566
C  1.682476 1.474344 -2.229499
C  1.155757 2.592601 -1.60206
C  0.670603 4.055989 1.61781
C  1.970842 4.174568 2.093022
C  -0.413585 4.369564 2.423382
C  2.175946 4.607983 3.394742
C  -0.192835 4.814673 3.719505
C  1.099577 4.930032 4.211761
H  -2.541147 -1.73857 0.390585
H  -0.232857 -3.402734 -0.810565
H  -1.221521 -4.221976 2.742251
H  -2.956804 -4.118451 2.468245
H  -2.002609 -2.649478 2.578233
H  -2.935134 -5.545889 0.354439
H  -1.22773 -5.838891 0.674628
H  -1.733532 -5.227168 -0.895816
H  -3.598946 -3.560404 -1.59065
H  2.098152 -0.666446 1.763707
H  1.208776 1.462582 1.601131
H  2.461988 -0.507074 -1.997465
H  1.80961 1.477493 -3.303912
H  0.866264 3.462614 -2.17797
H  2.816276 3.939083 1.458109
H  -1.420279 4.272495 2.035852
H  3.187733 4.70235 3.76759
H  -1.038466 5.065417 4.347101
H  1.268377 5.273069 5.224064
elementType: Cl O N C H
totalener: -2050.68396694 hartree
nucrepener: 2826.64043686 hartree
electener: -4877.32440380 hartree
oneelecener: -8429.28547314 hartree
twoeener: 3551.96106933 hartree
cpcmener: -0.02932158 hartree
kineticenergy: 2044.48121766 hartree
xcener: -151.864484313103 hartree
chargesum: 0.0000000
charge: -0.054536 -0.055780 -0.273375 -0.445338 -0.325307 -0.088390 0.133594 -0.035391 -0.118351 -0.268573 -0.279164 -0.228533 0.374062 0.091892 0.414452 0.028652 -0.225027 -0.162843 -0.271490 0.275607 -0.121552 -0.223769 0.274885 -0.191791 -0.239675 -0.141096 -0.123991 -0.180601 0.115382 0.113033 0.100270 0.095799 0.094384 0.102419 0.100630 0.093242 0.140163 0.134516 0.139448 0.143064 0.159825 0.148384 0.158087 0.146611 0.159660 0.158115 0.158397
qa: -0.0545 -0.0558 -0.2734 -0.4453 -0.3253 -0.0884 0.1336 -0.0354 -0.1184 -0.2686 -0.2792 -0.2285 0.3741 0.0919 0.4145 0.0287 -0.2250 -0.1628 -0.2715 0.2756 -0.1216 -0.2238 0.2749 -0.1918 -0.2397 -0.1411 -0.1240 -0.1806 0.1154 0.1130 0.1003 0.0958 0.0944 0.1024 0.1006 0.0932 0.1402 0.1345 0.1394 0.1431 0.1598 0.1484 0.1581 0.1466 0.1597 0.1581 0.1584
va: 1.2939 1.2506 2.1308 2.0614 2.0846 3.1122 3.7199 3.8696 3.8264 3.8905 3.9151 3.9165 4.1889 4.1808 3.7331 3.5718 4.0648 3.9235 3.9643 3.7444 3.8664 4.0103 3.6967 3.9258 4.0136 3.8871 3.8844 3.9038 1.0238 1.0242 0.9992 1.0011 1.0179 0.9996 1.0028 0.9993 1.0088 1.0187 1.0179 1.0124 0.9888 1.0048 0.9964 1.0074 0.9900 0.9893 0.9903
dispcorr: -0.025765557 hartree
energy: -2050.709732497929
dipole: 1.54716 -3.10646 -1.55930 -2.34629 1.82676 -0.51953 26.82961 -26.18084 0.64877
magnitude: 1.76698 au
magnitude: 4.49132 debye
