program: Orca
programVersion: 5.0.2
elementType: Cl Cl O O O N C C C C C C C C C C C C C C C C C C C C C C H H H H H H H H H H H H H H H H H H H
charge: 0
multiplicity: 1
keywords: wb97x-d3
keywords: def2-TZVPP
keywords: def2/J RIJCOSX
keywords: DEFGRID2
keywords: scfconv7
keywords: smallprint printgap noloewdin
keywords: NOSOSCF
formula: C22H19Cl2NO3
InChI: InChI=1/C22H19Cl2NO3/c1-22(2)17(12-19(23)24)20(22)21(26)28-18(13-25)14-7-6-10-16(11-14)27-15-8-4-3-5-9-15/h3-12,17-18,20H,1-2H3
47 atoms
Cl -1.363619 -0.821603 -2.474038
Cl -3.307147 -2.261437 -4.055788
O  1.356055 -1.94799 0.282518
O  -0.305879 -1.114249 1.5204
O  0.404632 3.69692 0.328145
N  4.649973 -1.652044 0.316635
C  -1.781196 -3.776329 0.706202
C  -2.209843 -2.636449 -0.148391
C  -0.730102 -2.922752 0.011695
C  -1.978853 -3.690208 2.198864
C  -1.915266 -5.178368 0.163183
C  -2.842789 -2.820312 -1.47259
C  0.079944 -1.910978 0.703952
C  -2.543983 -2.071903 -2.525783
C  2.187439 -0.866068 0.695393
C  1.878171 0.373632 -0.109764
C  3.560905 -1.322514 0.472506
C  1.347009 1.482701 0.532066
C  2.044569 0.362602 -1.490262
C  0.989038 2.595971 -0.219227
C  1.678047 1.478443 -2.225477
C  1.153059 2.597303 -1.5976
C  0.677251 4.066369 1.619024
C  1.980599 4.181542 2.086529
C  -0.400809 4.38964 2.429104
C  2.194948 4.620984 3.384729
C  -0.17068 4.840592 3.72151
C  1.124853 4.952483 4.206044
H  -2.550682 -1.755559 0.390762
H  -0.235712 -3.398896 -0.827091
H  -1.983107 -2.669848 2.574984
H  -1.198604 -4.242439 2.725977
H  -2.936873 -4.140061 2.46632
H  -1.730733 -5.234892 -0.910511
H  -2.919255 -5.565051 0.349759
H  -1.207023 -5.848086 0.653747
H  -3.607927 -3.580145 -1.586476
H  2.083148 -0.667235 1.766822
H  1.201594 1.465431 1.604952
H  2.454513 -0.504259 -1.994079
H  1.80569 1.48217 -3.299834
H  0.865396 3.468236 -2.173052
H  2.821357 3.939247 1.448031
H  -1.410003 4.295548 2.047671
H  3.209257 4.712853 3.751253
H  -1.011747 5.098871 4.352057
H  1.301007 5.300075 5.215524
elementType: Cl O N C H
totalener: -2050.68402546 hartree
nucrepener: 2824.44927194 hartree
electener: -4875.13329739 hartree
oneelecener: -8424.90336206 hartree
twoeener: 3549.77006466 hartree
cpcmener: -0.02933740 hartree
kineticenergy: 2044.47927713 hartree
xcener: -151.864087723187 hartree
chargesum: 0.0000000
charge: -0.054712 -0.055726 -0.273391 -0.445234 -0.325453 -0.088280 0.132255 -0.034245 -0.118636 -0.268344 -0.279037 -0.228923 0.374280 0.091773 0.413895 0.028573 -0.224977 -0.161856 -0.269644 0.273710 -0.121582 -0.223924 0.274555 -0.191075 -0.240169 -0.141399 -0.123786 -0.180831 0.115137 0.113352 0.094448 0.100186 0.095864 0.093332 0.102416 0.100629 0.140228 0.134548 0.139718 0.143395 0.159746 0.148386 0.158029 0.146617 0.159608 0.158114 0.158430
qa: -0.0547 -0.0557 -0.2734 -0.4452 -0.3255 -0.0883 0.1323 -0.0342 -0.1186 -0.2683 -0.2790 -0.2289 0.3743 0.0918 0.4139 0.0286 -0.2250 -0.1619 -0.2696 0.2737 -0.1216 -0.2239 0.2746 -0.1911 -0.2402 -0.1414 -0.1238 -0.1808 0.1151 0.1134 0.0944 0.1002 0.0959 0.0933 0.1024 0.1006 0.1402 0.1345 0.1397 0.1434 0.1597 0.1484 0.1580 0.1466 0.1596 0.1581 0.1584
va: 1.2931 1.2506 2.1310 2.0614 2.0842 3.1120 3.7215 3.8686 3.8253 3.8908 3.9148 3.9161 4.1889 4.1807 3.7335 3.5726 4.0651 3.9237 3.9653 3.7453 3.8683 4.0107 3.6974 3.9245 4.0132 3.8875 3.8845 3.9039 1.0240 1.0240 1.0179 0.9992 1.0011 0.9992 0.9996 1.0028 1.0088 1.0188 1.0175 1.0122 0.9888 1.0048 0.9964 1.0075 0.9900 0.9892 0.9903
dispcorr: -0.025719819 hartree
energy: -2050.709745276214
dipole: 1.81001 -3.35273 -1.54272 -2.30326 1.77262 -0.53064 26.80643 -26.15535 0.65107
magnitude: 1.75655 au
magnitude: 4.46479 debye
