program: Orca
programVersion: 5.0.2
elementType: Cl Cl O O O N C C C C C C C C C C C C C C C C C C C C C C H H H H H H H H H H H H H H H H H H H
charge: 0
multiplicity: 1
keywords: wb97x-d3
keywords: def2-TZVPP
keywords: def2/J RIJCOSX
keywords: DEFGRID2
keywords: scfconv7
keywords: smallprint printgap noloewdin
keywords: NOSOSCF
formula: C22H19Cl2NO3
InChI: InChI=1/C22H19Cl2NO3/c1-22(2)17(12-19(23)24)20(22)21(26)28-18(13-25)14-7-6-10-16(11-14)27-15-8-4-3-5-9-15/h3-12,17-18,20H,1-2H3
47 atoms
Cl -1.519098 -0.899322 2.080873
Cl -4.290501 -1.483378 2.654031
O  0.769815 -1.470491 -1.111246
O  1.465408 -3.101904 0.25793
O  0.538682 3.697447 0.350703
N  2.617017 0.07035 -3.38744
C  -1.304583 -4.425188 -0.471505
C  -1.397552 -3.682355 0.814079
C  -0.832146 -2.980473 -0.405223
C  -0.315585 -5.55782 -0.585927
C  -2.561157 -4.640911 -1.279554
C  -2.678924 -3.211608 1.38229
C  0.579993 -2.574015 -0.365087
C  -2.813201 -2.026961 1.961711
C  2.021755 -0.796435 -0.997019
C  1.901948 0.317617 0.013333
C  2.340312 -0.310608 -2.340203
C  1.310194 1.525016 -0.336871
C  2.299583 0.083436 1.32471
C  1.141144 2.506495 0.630054
C  2.099535 1.064098 2.284723
C  1.528934 2.279986 1.943357
C  0.845096 4.373822 -0.799838
C  2.141078 4.441771 -1.296908
C  -0.191427 5.050238 -1.427364
C  2.38886 5.189652 -2.439075
C  0.074405 5.804121 -2.561456
C  1.361544 5.872155 -3.076568
H  -0.651256 -3.951379 1.557824
H  -1.488396 -2.267099 -0.890142
H  0.538657 -5.450164 0.078556
H  0.058458 -5.648461 -1.607175
H  -0.809587 -6.497751 -0.332402
H  -3.095744 -5.525043 -0.926769
H  -2.315907 -4.801526 -2.330738
H  -3.246325 -3.79388 -1.228142
H  -3.541087 -3.868201 1.352246
H  2.819535 -1.486446 -0.708512
H  0.982456 1.704491 -1.35467
H  2.759447 -0.857405 1.597411
H  2.403072 0.886201 3.307862
H  1.384794 3.051893 2.688752
H  2.954904 3.925834 -0.802781
H  -1.195638 4.990938 -1.026472
H  3.397928 5.241563 -2.827334
H  -0.734348 6.334557 -3.047492
H  1.563563 6.455392 -3.965223
elementType: Cl O N C H
totalener: -2050.68371676 hartree
nucrepener: 2810.50678883 hartree
electener: -4861.19050559 hartree
oneelecener: -8397.04692455 hartree
twoeener: 3535.85641896 hartree
cpcmener: -0.02858514 hartree
kineticenergy: 2044.47354885 hartree
xcener: -151.862418742021 hartree
chargesum: 0.0000000
charge: -0.057418 -0.054995 -0.274010 -0.443721 -0.327432 -0.088744 0.135902 -0.036310 -0.128578 -0.270191 -0.279090 -0.221487 0.380168 0.089857 0.409299 0.015859 -0.224666 -0.176101 -0.187448 0.223972 -0.124727 -0.216269 0.272407 -0.176431 -0.245553 -0.147896 -0.121442 -0.184033 0.115088 0.113700 0.093778 0.100776 0.095847 0.102247 0.099823 0.094112 0.140925 0.134279 0.140810 0.146899 0.158916 0.148244 0.154009 0.145956 0.158962 0.157009 0.157700
qa: -0.0574 -0.0550 -0.2740 -0.4437 -0.3274 -0.0887 0.1359 -0.0363 -0.1286 -0.2702 -0.2791 -0.2215 0.3802 0.0899 0.4093 0.0159 -0.2247 -0.1761 -0.1874 0.2240 -0.1247 -0.2163 0.2724 -0.1764 -0.2456 -0.1479 -0.1214 -0.1840 0.1151 0.1137 0.0938 0.1008 0.0958 0.1022 0.0998 0.0941 0.1409 0.1343 0.1408 0.1469 0.1589 0.1482 0.1540 0.1460 0.1590 0.1570 0.1577
va: 1.2892 1.2515 2.1133 2.0617 2.0765 3.1057 3.7127 3.8746 3.8277 3.8897 3.9153 3.9105 4.1852 4.1773 3.7310 3.6341 4.0731 3.9819 3.9174 3.7881 3.8951 4.0138 3.7023 3.8921 4.0054 3.8987 3.8882 3.9040 1.0228 1.0246 1.0180 0.9994 1.0011 0.9992 1.0031 0.9992 1.0083 1.0243 1.0118 1.0111 0.9892 1.0041 0.9980 1.0079 0.9904 0.9892 0.9905
dispcorr: -0.025454349 hartree
energy: -2050.709171107241
dipole: 9.66400 -10.40840 -0.74440 -7.31277 6.25367 -1.05910 -16.39656 17.10578 0.70922
magnitude: 1.47608 au
magnitude: 3.75190 debye
