program: Gaussian 09
title: 000074377
version: EM64L-G09RevD.01
frameworkgroup: C1[X(C7H4BrClO)]
method: RPBEPBE
basis: SDD
operation: Freq
keyword: #p
keyword: freq=noraman
keyword: PBEPBE/SDD
title: #p freq=noraman PBEPBE/SDD
converged: NO YES NO NO
title: Mulliken charges:
elementType: Br Cl O C C C C C C C H H H H
charge: 0.040528 -0.091760 -0.103606 0.419438 -0.298820 -0.299599 -0.186201 -0.202174 -0.177303 -0.173099 0.292092 0.270614 0.247454 0.262435
chargesum: 0.00000
title: Mulliken charges with hydrogens summed into heavy atoms:
elementType: Br Cl O C C C C C C C
charge: 0.040528 -0.091760 -0.103606 0.419438 -0.006728 -0.028985 -0.186201 0.045280 0.085133 -0.173099
polarizability: 1.65707495e+02 6.60652070e+00 1.08272385e+02 1.06919840e-02 6.01456431e-03 3.56459240e+01
1716.lowfreq: -16.9425 -5.6390 -0.0022 -0.0019 -0.0011 7.2628 30.4194 122.0766 138.9070
frequency: 30.3340 122.0766 138.8996 171.8195 204.2979 289.0788 350.3012 385.0070 412.3265 471.8390 491.2846 640.7941 643.3478 666.3257 687.5714 807.0657 882.1384 920.9560 940.1898 983.1144 996.8434 1069.0735 1099.3913 1181.5352 1193.8455 1291.0566 1382.9313 1403.2540 1456.2762 1564.9303 1595.8920 1711.3211 3155.5104 3175.8269 3176.6845 3187.5102
redmass: 16.2875 15.0978 5.8446 4.4997 19.0284 6.9471 8.4086 14.9944 3.3308 4.9714 8.6029 5.9442 7.3760 8.6571 2.3170 1.4558 8.5228 1.4068 1.4180 5.9951 1.3588 2.2579 1.5546 1.2542 2.3438 1.2815 7.4403 3.1118 2.2538 6.3782 6.7563 12.9806 1.0881 1.0933 1.0931 1.0985
irintensity: 0.0572 2.2589 0.0881 0.5635 0.2967 0.0202 19.5123 18.5018 0.7119 8.4226 0.0780 0.0104 5.0077 209.8425 45.3233 38.6843 58.0697 8.2091 6.5067 8.4356 0.1796 29.7999 4.5749 91.9834 201.9382 1.3920 0.9623 52.4743 19.4680 41.3409 7.0891 252.4478 4.4024 0.9400 1.4861 5.8665
temp: 298.150 k
press: 1.00000 atm
elementType: 35 17 8 6 6 6 6 6 6 6 1 1 1 1
symmnumber: 1
zpe: 232557.9 jmol-1
zpe.correction: 0.088577 hartree
zpe.thermalcorrener: 0.097654 hartree
zpe.thermalcorrenthalpy: 0.098598 hartree
zpe.thermalcorrgfe: 0.051756 hartree
zpe.sumelectzpe: -817.191270 hartree
zpe.sumelectthermal: -817.182192 hartree
zpe.sumelectthermalent: -817.181248 hartree
zpe.sumelectthermalfe: -817.228090 hartree
dipole: -2.0862 3.4509 0.0004
dipole: 4.0325
quadrupole: -83.6708 -68.9496 -75.5487
quadrupole: 4.7175 0.0006 0.0010
quadrupole: -7.6144 7.1067 0.5077 4.7175 0.0006 0.0010
hfenergy: -817.2798463 hartree
pointgroup: C01 [X(C7H4Br1Cl1O1)]
dipole: -1.1352809 -1.1082379 -0.0001622 debye
dipolederiv: -0.4873339 0.2969526 0.0000763 0.3443494 -0.269832 -0.0000607 0.0000842 -0.0000609 -0.0153452 -0.899253 0.3582087 0.0000007 0.5148339 -0.4967062 0.0000092 -0.0000756 0.0000451 -0.1398407 -0.6730015 -0.1386041 0.0000181 -0.0891175 -1.1038965 0.0000498 -0.0000031 -0.0001494 -0.228861 -0.7953626 -0.1856449 0.0000087 -0.1701579 -0.0755873 0.0000249 0.0000471 0.0000176 0.0193471 -0.1767275 0.3155256 0.0000451 -0.0049933 -0.0936478 -0.0000163 0.0000583 -0.0000299 -0.0462654 0.055723 -0.0557381 -0.0000255 0.2115529 -0.0569453 -0.0000141 0.0000361 0.0000012 -0.1066695 0.8428314 -0.737774 -0.0001782 -0.7907755 0.3569209 0.0001264 -0.0001989 0.0001337 -0.1242189 -0.1511736 0.0270395 0.0000039 0.1123693 0.1584405 0.0000243 0.0000042 0.0000226 -0.1288686 -0.1137991 0.214063 0.0000249 0.180857 -0.0979287 -0.0000229 0.0000318 -0.0000243 -0.064135 2.1529179 -0.0702748 -0.0000122 -0.2979696 1.5353678 -0.0000673 -0.0000172 0.0000822 0.191469 0.1400742 -0.0402445 0.0000016 0.0079567 0.0374921 -0.0000138 0.0000009 -0.0000104 0.1617224 0.0660578 0.0717803 0.0000181 0.0469574 0.0862908 -0.0000119 0.0000121 -0.0000016 0.1618817 0.0562177 -0.0074332 0.0000072 -0.026259 -0.0782339 -0.0000251 0.0000014 -0.0000234 0.1618119 -0.0171705 -0.0478561 0.0000113 -0.0396038 0.0982654 -0.0000026 0.0000186 -0.0000025 0.1579723 unknown
polarizability: 158.8793373|-19.7281104|115.1005427|-0.0088402|0.0085056|35.645924 unknown
InChI: InChI=1S/C7H4BrClO/c8-6-3-1-2-5(4-6)7(9)10/h1-4H
charge 0 multiplicity 1
14 atoms
Br -3.331961 1.552251 0.000403
Cl 3.40296 -0.655281 -0.000107
O  2.219212 1.795902 -0.000032
C  0.608847 -0.032817 -0.000169
C  -0.50112 0.86256 0.000024
C  0.396392 -1.433823 -0.000307
C  -1.799833 0.331038 0.000106
C  -0.919531 -1.938426 -0.000227
C  -2.029523 -1.062746 -0.000024
C  1.954822 0.595286 -0.000248
H  -0.323171 1.941431 0.000114
H  1.254808 -2.110058 -0.000441
H  -1.090456 -3.019281 -0.000325
H  -3.049846 -1.456138 0.000032
