program: Orca
programVersion: 4.2.1
elementType: O O O O O O N N C C C C C C C C C C C C C C C C C C H H H H H H H H H H H H H H H H H H H H H H H H
charge: 0
multiplicity: 1
keywords: wb97x-d3
keywords: def2-TZVPP
keywords: def2/J RIJCOSX GRIDX6 NOFINALGRIDX
keywords: grid4 nofinalgrid
keywords: scfconv7
keywords: smallprint printgap noloewdin
keywords: NOSOSCF
formula: C18H24N2O6
InChI: InChI=1/C18H24N2O6/c1-4-6-7-8-10-13(3)15-11-14(19(22)23)12-16(20(24)25)18(15)26-17(21)9-5-2/h5,9,11-13H,4,6-8,10H2,1-3H3
50 atoms
O  -0.583695 0.805088 1.176011
O  0.474934 3.279067 1.166832
O  1.693613 3.633636 -0.558641
O  5.151989 0.347834 -1.21429
O  4.70935 -1.715414 -0.850968
O  -1.311037 1.674148 -0.762549
N  1.19007 2.917306 0.266413
N  4.431142 -0.542274 -0.841071
C  0.06661 -1.915466 1.101886
C  0.062099 -3.180243 0.237391
C  -0.208428 -2.973575 -1.252574
C  -1.421226 -2.110966 -1.590555
C  0.99523 -0.836079 0.596268
C  -2.737727 -2.575141 -0.979626
C  0.418732 -2.252069 2.552955
C  -3.910623 -1.68465 -1.372903
C  0.631947 0.511503 0.650941
C  2.257194 -1.158857 0.119911
C  1.513138 1.493313 0.192902
C  3.112631 -0.170685 -0.330487
C  2.752501 1.161142 -0.31563
C  -5.212416 -2.07712 -0.690198
C  -1.523755 1.400009 0.381282
C  -2.769101 1.587059 1.128861
C  -3.851083 2.071879 0.520665
C  -5.167393 2.285662 1.173296
H  -0.949619 -1.518498 1.099203
H  -0.696796 -3.845513 0.658698
H  1.006319 -3.721852 0.356644
H  -0.325382 -3.959828 -1.710911
H  0.670216 -2.531387 -1.73042
H  -1.526638 -2.08212 -2.678978
H  -1.232368 -1.073401 -1.300938
H  -2.942417 -3.608076 -1.281915
H  -2.664087 -2.595276 0.113238
H  -0.263924 -3.006029 2.947231
H  1.432528 -2.648906 2.631159
H  0.353544 -1.374114 3.195487
H  -3.669138 -0.64561 -1.12798
H  -4.039087 -1.713268 -2.458783
H  2.571066 -2.192846 0.087699
H  3.420103 1.927042 -0.681993
H  -5.125044 -2.006244 0.395583
H  -6.036553 -1.431974 -0.99632
H  -5.49507 -3.103774 -0.928715
H  -2.78082 1.313884 2.176747
H  -3.778424 2.331317 -0.531074
H  -5.466074 3.332643 1.094877
H  -5.941353 1.70508 0.66715
H  -5.160915 2.007478 2.225513
totalener: -1261.15748516 hartree
nucrepener: 2500.51199985 hartree
electener: -3761.66948500 hartree
oneelecener: -6688.02717306 hartree
twoeener: 2926.35768806 hartree
kineticenergy: 1256.03667312 hartree
xcener: -118.903298717933 hartree
chargesum: 0.0000000
charge: -0.271681 -0.320296 -0.315489 -0.328144 -0.333493 -0.325399 0.507145 0.513754 0.054675 -0.196402 -0.145334 -0.101308 0.063611 -0.162521 -0.264540 -0.067542 0.152983 -0.181995 0.065817 -0.066353 -0.048325 -0.261279 0.373038 -0.259129 -0.013915 -0.197520 0.046125 0.089550 0.082927 0.082927 0.089255 0.080177 0.067775 0.073722 0.052657 0.091920 0.089772 0.100073 0.038712 0.066668 0.160626 0.165751 0.070064 0.083799 0.079570 0.105233 0.134662 0.101949 0.093937 0.081793
qa: -0.2717 -0.3203 -0.3155 -0.3281 -0.3335 -0.3254 0.5071 0.5138 0.0547 -0.1964 -0.1453 -0.1013 0.0636 -0.1625 -0.2645 -0.0675 0.1530 -0.1820 0.0658 -0.0664 -0.0483 -0.2613 0.3730 -0.2591 -0.0139 -0.1975 0.0461 0.0895 0.0829 0.0829 0.0893 0.0802 0.0678 0.0737 0.0527 0.0919 0.0898 0.1001 0.0387 0.0667 0.1606 0.1658 0.0701 0.0838 0.0796 0.1052 0.1347 0.1019 0.0939 0.0818
va: 2.1048 1.9117 1.9371 1.9287 1.9233 2.1548 4.1414 4.1717 3.7788 3.8461 3.9069 3.8387 3.6688 3.8603 3.9320 3.8804 4.0841 4.0765 3.9311 4.1117 4.1428 3.9434 4.1855 3.9476 3.8250 3.9525 1.0332 1.0023 1.0130 1.0086 1.0078 1.0157 1.0282 1.0133 1.0051 1.0050 1.0045 1.0075 1.0172 1.0119 1.0220 1.0397 1.0023 1.0058 1.0053 1.0276 1.0169 0.9991 0.9991 1.0106
dispcorr: -0.027774370 hartree
energy: -1261.185259527309
dipole: -46.18402 43.79747 -2.38655 -28.78489 27.58343 -1.20145 1.87853 -0.81091 1.06762
magnitude: 2.87731 au
magnitude: 7.31354 debye
