program: Orca
programVersion: 4.2.1
elementType: O O O O O O N N C C C C C C C C C C C C C C C C C C H H H H H H H H H H H H H H H H H H H H H H H H
charge: 0
multiplicity: 1
keywords: wb97x-d3
keywords: def2-TZVPP
keywords: def2/J RIJCOSX GRIDX6 NOFINALGRIDX
keywords: grid4 nofinalgrid
keywords: scfconv7
keywords: smallprint printgap noloewdin
keywords: NOSOSCF
formula: C18H24N2O6
InChI: InChI=1/C18H24N2O6/c1-4-6-7-8-10-13(3)15-11-14(19(22)23)12-16(20(24)25)18(15)26-17(21)9-5-2/h5,9,11-13H,4,6-8,10H2,1-3H3
50 atoms
O  -0.365268 1.469756 1.335605
O  1.324438 3.499049 1.860114
O  2.648375 3.894265 0.223573
O  5.102151 0.038348 -1.283721
O  4.107569 -1.855359 -1.383384
O  -0.771428 2.933705 -0.317567
N  1.942901 3.172253 0.878056
N  4.156462 -0.684719 -1.098713
C  -0.490508 -1.221029 0.609294
C  -0.676279 -2.321664 -0.440074
C  -2.052752 -2.975144 -0.395319
C  -2.239635 -4.022855 -1.485631
C  0.72291 -0.358741 0.338694
C  -3.621143 -4.663886 -1.468228
C  -0.398462 -1.785009 2.030388
C  -3.813974 -5.709529 -2.559143
C  0.738162 0.987177 0.714968
C  1.864036 -0.89102 -0.242185
C  1.8676 1.770524 0.468195
C  2.971524 -0.096228 -0.476546
C  2.987102 1.241271 -0.142171
C  -5.201643 -6.333851 -2.542412
C  -1.057824 2.499859 0.757868
C  -2.155616 2.918329 1.63177
C  -2.968133 3.908557 1.265424
C  -4.094548 4.426695 2.082421
H  -1.375679 -0.581533 0.558986
H  0.087458 -3.097186 -0.317263
H  -0.524974 -1.896352 -1.437194
H  -2.822639 -2.203044 -0.499452
H  -2.221382 -3.442182 0.579475
H  -1.475862 -4.800412 -1.37811
H  -2.065319 -3.563986 -2.464616
H  -3.797351 -5.124037 -0.489816
H  -4.384035 -3.884939 -1.574659
H  0.466407 -2.443289 2.130262
H  -0.300099 -0.991229 2.770327
H  -1.287707 -2.36016 2.285841
H  -3.630592 -5.251645 -3.535755
H  -3.057942 -6.492537 -2.448101
H  1.888002 -1.931781 -0.530366
H  3.849506 1.860277 -0.341079
H  -5.976539 -5.579663 -2.689349
H  -5.315602 -7.079186 -3.3296
H  -5.402629 -6.827762 -1.590358
H  -2.270192 2.412813 2.582618
H  -2.799183 4.386938 0.305722
H  -3.949321 5.486971 2.298592
H  -5.034241 4.350473 1.531959
H  -4.203089 3.895856 3.026445
totalener: -1261.15938670 hartree
nucrepener: 2341.91754367 hartree
electener: -3603.07693036 hartree
oneelecener: -6370.95190590 hartree
twoeener: 2767.87497554 hartree
kineticenergy: 1256.03750404 hartree
xcener: -118.898660160727 hartree
chargesum: 0.0000000
charge: -0.291047 -0.321592 -0.314312 -0.327974 -0.334481 -0.322291 0.502606 0.511818 0.050456 -0.115670 -0.132974 -0.103611 0.045571 -0.113733 -0.284152 -0.080062 0.149319 -0.095208 0.054315 -0.107555 -0.041175 -0.260304 0.377682 -0.238926 -0.013803 -0.197200 0.044039 0.060926 0.098665 0.061738 0.062079 0.058572 0.058904 0.054009 0.053498 0.090258 0.098509 0.091653 0.053861 0.053987 0.155723 0.165387 0.073170 0.086914 0.072362 0.105532 0.129221 0.099434 0.094541 0.081320
qa: -0.2910 -0.3216 -0.3143 -0.3280 -0.3345 -0.3223 0.5026 0.5118 0.0505 -0.1157 -0.1330 -0.1036 0.0456 -0.1137 -0.2842 -0.0801 0.1493 -0.0952 0.0543 -0.1076 -0.0412 -0.2603 0.3777 -0.2389 -0.0138 -0.1972 0.0440 0.0609 0.0987 0.0617 0.0621 0.0586 0.0589 0.0540 0.0535 0.0903 0.0985 0.0917 0.0539 0.0540 0.1557 0.1654 0.0732 0.0869 0.0724 0.1055 0.1292 0.0994 0.0945 0.0813
va: 2.1023 1.9077 1.9352 1.9291 1.9218 2.1840 4.1412 4.1736 3.8153 3.8692 3.8872 3.8849 3.7212 3.8895 3.9348 3.8901 4.1171 4.0556 3.9293 4.1489 4.1332 3.9539 4.1945 3.9488 3.8482 3.9516 1.0292 1.0124 1.0103 1.0121 1.0134 1.0130 1.0137 1.0102 1.0104 1.0036 1.0098 1.0062 1.0077 1.0075 1.0269 1.0381 1.0027 1.0058 1.0031 1.0252 1.0186 0.9984 0.9993 1.0105
dispcorr: -0.022358551 hartree
energy: -1261.181745247964
dipole: -52.60433 49.98114 -2.62319 -42.03896 41.27419 -0.76478 -4.33320 5.31236 0.97916
magnitude: 2.90255 au
magnitude: 7.37769 debye
