program: Gaussian 09
title: 000074383
version: EM64L-G09RevD.01
frameworkgroup: C1[X(C11H16O)]
method: RPBEPBE
basis: SDD
operation: Freq
keyword: #pfreq=noraman
keyword: PBEPBE/SDD
title: #p freq=noraman PBEPBE/SDD
converged: YES YES NO NO
title: Mulliken charges:
elementType: O C C C C C C C C C C C H H H H H H H H H H H H H H H H
charge: -0.293058 0.222301 0.385042 -0.775971 -0.714292 -0.401152 -0.371056 -0.225105 -0.237471 -0.244093 -0.687635 -0.242432 0.239166 0.214643 0.227816 0.224605 0.210474 0.239247 0.237859 0.263581 0.195622 0.205477 0.222765 0.225011 0.201692 0.223024 0.226470 0.227470
chargesum: 0.00000
title: Mulliken charges with hydrogens summed into heavy atoms:
elementType: O C C C C C C C C C C C
charge: -0.293058 0.222301 0.385042 -0.094346 -0.039966 -0.163293 -0.107475 0.175994 -0.014706 -0.019082 -0.036449 -0.014962
polarizability: 1.40877074e+02 -7.44647865e+00 1.18088314e+02 -7.80188213e+00 -1.22501315e+01 9.52223843e+01
1716.lowfreq: -17.4152 -7.0657 0.0006 0.0007 0.0007 4.8565 40.4060 52.2349 95.4000
frequency: 40.3245 52.2231 95.3834 137.0340 179.4514 198.5731 217.6637 245.9372 257.7071 290.6056 313.2668 322.8362 343.1778 406.0816 439.9785 490.4418 539.7663 569.6470 616.6716 697.9865 709.5654 772.2567 781.2681 818.4581 859.5986 896.8958 913.7553 931.4491 939.8386 983.5167 989.3240 995.9265 1001.6031 1025.4406 1043.3479 1075.0837 1102.0963 1109.5287 1136.9103 1152.6159 1171.0310 1188.5754 1203.8661 1251.2525 1261.0286 1314.1946 1363.5348 1373.3320 1378.9326 1389.0725 1391.3546 1433.2637 1453.0853 1458.7715 1463.0251 1474.6759 1478.6578 1480.5296 1485.5850 1493.8678 1589.3753 1611.6255 2944.6428 2987.2441 2990.1216 2992.1672 2996.9947 3082.9411 3087.5362 3090.1644 3096.0213 3096.4753 3100.4249 3119.9429 3127.5828 3141.4780 3148.6919 3162.4399
redmass: 3.5592 2.5221 2.2301 2.7949 2.7609 1.4380 1.4432 1.4035 1.0981 3.0409 2.9074 3.0611 3.1276 2.8622 3.3710 3.2731 3.3161 3.0947 6.4158 5.0351 1.6958 1.9164 2.7244 1.0959 1.2507 2.5504 1.6529 1.3970 2.2137 1.3714 4.4938 1.4212 1.3178 2.3904 3.5244 1.6628 1.9788 2.1887 1.4714 2.1214 1.0535 1.1301 3.6015 1.7276 1.6877 1.3491 1.2876 1.3615 4.7432 1.2102 1.2654 2.1805 1.0795 1.0413 1.0538 1.0632 1.5390 1.1067 1.2155 1.0828 6.0976 6.0574 1.0551 1.0368 1.0357 1.0359 1.1032 1.0992 1.0990 1.1006 1.1006 1.1003 1.1001 1.0842 1.0875 1.0919 1.0957 1.1013
irintensity: 0.2961 0.0321 1.2439 3.6885 0.4179 1.8058 1.3698 1.8470 0.1556 0.8304 0.6449 0.8665 5.3568 0.0604 0.6099 6.7949 5.4278 12.7126 0.0624 2.2893 57.3693 40.7295 5.2306 2.7754 0.2473 7.5960 9.4360 4.2740 22.7351 0.2422 0.0521 0.4864 1.3333 16.8571 88.7680 16.0181 8.1631 4.4083 4.2848 56.6459 0.3978 2.2459 10.0094 23.0332 38.5128 1.3145 12.3067 18.8295 1.1332 17.2720 27.9719 15.0496 2.7570 10.4224 1.7243 5.6347 7.6294 8.6470 17.7715 2.4778 0.6178 3.3970 46.9323 16.2378 32.0803 13.0734 49.6995 20.1969 35.5842 14.4887 8.3915 87.5755 26.4741 1.0565 2.9251 16.7923 41.1401 20.8147
temp: 298.150 k
press: 1.00000 atm
elementType: 8 6 6 6 6 6 6 6 6 6 6 6 1 1 1 1 1 1 1 1 1 1 1 1 1 1 1 1
symmnumber: 1
zpe: 631429.3 jmol-1
zpe.correction: 0.240499 hartree
zpe.thermalcorrener: 0.253265 hartree
zpe.thermalcorrenthalpy: 0.254209 hartree
zpe.thermalcorrgfe: 0.201551 hartree
zpe.sumelectzpe: -503.060617 hartree
zpe.sumelectthermal: -503.047851 hartree
zpe.sumelectthermalent: -503.046907 hartree
zpe.sumelectthermalfe: -503.099565 hartree
dipole: 0.4910 0.2363 -1.1845
dipole: 1.3038
quadrupole: -71.4659 -68.8763 -73.5376
quadrupole: -0.7214 1.1416 -2.5167
quadrupole: -0.1726 2.4170 -2.2443 -0.7214 1.1416 -2.5167
hfenergy: -503.301116 hartree
pointgroup: C01 [X(C11H16O1)]
dipole: -0.1754601 -0.0384442 0.480494 debye
polarizability: 141.8196289|7.435461|107.4014502|-5.4168201|16.6752996|104.9666932 unknown
InChI: InChI=1S/C11H16O/c1-4-12-11(2,3)10-8-6-5-7-9-10/h5-9H,4H2,1-3H3
charge 0 multiplicity 1
28 atoms
O  1.936678 -0.086169 -0.44257
C  0.987058 0.948494 0.065108
C  -0.44738 0.37765 0.092126
C  1.463032 1.490567 1.432485
C  1.084223 2.054599 -1.011159
C  -1.396637 0.740748 1.080054
C  -0.855497 -0.501854 -0.94599
C  2.123392 -1.267895 0.419285
C  -2.719457 0.241183 1.032283
C  -2.17295 -1.004107 -0.995185
C  2.954141 -2.27121 -0.382999
C  -3.113832 -0.632226 -0.005539
H  2.537533 1.735026 1.363863
H  0.922059 2.415513 1.700482
H  1.317904 0.760999 2.248592
H  2.112019 2.456701 -1.045064
H  0.379271 2.875394 -0.791118
H  0.839546 1.638314 -2.002843
H  -1.112315 1.415824 1.894229
H  -0.118481 -0.795864 -1.702127
H  2.653502 -0.980694 1.351613
H  1.138987 -1.700132 0.696827
H  -3.439357 0.533904 1.805405
H  -2.467336 -1.68441 -1.802714
H  3.16184 -3.173493 0.221358
H  2.417023 -2.577228 -1.297699
H  3.916394 -1.821456 -0.684024
H  -4.13826 -1.019778 -0.042481
