program: Orca
programVersion: 4.2.1
elementType: O O O O O O N N C C C C C C C C C C C C C C C C C C H H H H H H H H H H H H H H H H H H H H H H H H
charge: 0
multiplicity: 1
keywords: wb97x-d3
keywords: def2-TZVPP
keywords: def2/J RIJCOSX GRIDX6 NOFINALGRIDX
keywords: grid4 nofinalgrid
keywords: scfconv7
keywords: smallprint printgap noloewdin
keywords: NOSOSCF
formula: C18H24N2O6
InChI: InChI=1/C18H24N2O6/c1-4-6-7-8-10-13(3)15-11-14(19(22)23)12-16(20(24)25)18(15)26-17(21)9-5-2/h5,9,11-13H,4,6-8,10H2,1-3H3
50 atoms
O  -1.018022 1.304393 0.916953
O  1.827126 3.716697 -0.586886
O  -0.288699 3.386929 -0.611148
O  4.449965 -0.157888 -1.689731
O  3.844065 -2.073115 -0.947807
O  0.060504 2.6280 2.37421
N  0.852586 3.018123 -0.48761
N  3.685094 -0.889573 -1.114383
C  -0.575143 -1.461298 1.354417
C  -1.06987 -2.608099 0.466706
C  -1.815099 -2.139054 -0.777165
C  -2.38094 -3.270105 -1.631697
C  0.384086 -0.560831 0.607638
C  -1.316937 -4.151562 -2.277426
C  0.074981 -1.982944 2.636428
C  -1.877087 -5.244758 -3.184078
C  0.143805 0.801906 0.433273
C  1.551141 -1.097303 0.081173
C  1.079574 1.594711 -0.240109
C  2.462964 -0.295143 -0.576081
C  2.249477 1.05904 -0.736629
C  -2.58891 -4.722149 -4.424943
C  -0.968331 2.276328 1.878774
C  -2.319175 2.752959 2.182201
C  -2.507803 3.706824 3.092894
C  -3.827862 4.279906 3.458803
H  -1.449507 -0.875957 1.642961
H  -1.73334 -3.237954 1.068088
H  -0.226701 -3.249073 0.191192
H  -1.154765 -1.523386 -1.396561
H  -2.632478 -1.480506 -0.467235
H  -3.008742 -2.826494 -2.408637
H  -3.04908 -3.891536 -1.024813
H  -0.628875 -3.522363 -2.853564
H  -0.710129 -4.62563 -1.501053
H  -0.63507 -2.58696 3.20241
H  0.942631 -2.61043 2.425277
H  0.405831 -1.165787 3.277422
H  -1.055702 -5.895474 -3.494458
H  -2.559213 -5.878322 -2.608838
H  1.754946 -2.153002 0.194074
H  2.970326 1.684703 -1.241962
H  -1.934601 -4.072604 -5.009273
H  -2.901005 -5.54093 -5.073407
H  -3.483488 -4.15014 -4.177747
H  -3.14668 2.323176 1.631516
H  -1.63993 4.109969 3.605373
H  -3.843537 5.352867 3.257371
H  -4.648335 3.816826 2.913648
H  -4.013662 4.164518 4.528356
totalener: -1261.15754271 hartree
nucrepener: 2406.50884657 hartree
electener: -3667.66638928 hartree
oneelecener: -6500.19534203 hartree
twoeener: 2832.52895275 hartree
kineticenergy: 1256.04151686 hartree
xcener: -118.901477119909 hartree
chargesum: -0.0000000
charge: -0.286972 -0.314461 -0.321365 -0.327874 -0.333680 -0.325338 0.502969 0.511764 0.042380 -0.174303 -0.115974 -0.141687 -0.019389 -0.111738 -0.270657 -0.116675 0.189019 -0.059973 0.075093 -0.111318 -0.049182 -0.256688 0.376499 -0.239548 -0.012952 -0.198737 0.054930 0.079616 0.067707 0.068018 0.080577 0.078653 0.060669 0.063433 0.069474 0.091817 0.083984 0.108003 0.071390 0.052679 0.147281 0.165681 0.077170 0.087538 0.072639 0.105272 0.129018 0.099610 0.081177 0.094451
qa: -0.2870 -0.3145 -0.3214 -0.3279 -0.3337 -0.3253 0.5030 0.5118 0.0424 -0.1743 -0.1160 -0.1417 -0.0194 -0.1117 -0.2707 -0.1167 0.1890 -0.0600 0.0751 -0.1113 -0.0492 -0.2567 0.3765 -0.2395 -0.0130 -0.1987 0.0549 0.0796 0.0677 0.0680 0.0806 0.0787 0.0607 0.0634 0.0695 0.0918 0.0840 0.1080 0.0714 0.0527 0.1473 0.1657 0.0772 0.0875 0.0726 0.1053 0.1290 0.0996 0.0812 0.0945
va: 2.0959 1.9351 1.9083 1.9281 1.9247 2.1785 4.1425 4.1737 3.8355 3.8792 3.8798 3.8909 3.6519 3.8661 3.9406 3.9116 4.0515 4.0201 3.9162 4.1432 4.1393 3.9340 4.1960 3.9497 3.8488 3.9521 1.0316 1.0146 1.0140 1.0129 1.0130 1.0119 1.0095 1.0100 1.0150 1.0053 1.0035 1.0075 1.0063 1.0084 1.0278 1.0384 1.0022 1.0063 1.0024 1.0261 1.0185 0.9983 1.0103 0.9992
dispcorr: -0.023912764 hartree
energy: -1261.181455474192
dipole: -36.29275 33.83025 -2.46250 -35.33414 34.60754 -0.72660 -2.73803 3.89448 1.15645
magnitude: 2.81589 au
magnitude: 7.15742 debye
