program: Orca
programVersion: 4.2.1
elementType: O O O O O O N N C C C C C C C C C C C C C C C C C C H H H H H H H H H H H H H H H H H H H H H H H H
charge: 0
multiplicity: 1
keywords: wb97x-d3
keywords: def2-TZVPP
keywords: def2/J RIJCOSX GRIDX6 NOFINALGRIDX
keywords: grid4 nofinalgrid
keywords: scfconv7
keywords: smallprint printgap noloewdin
keywords: NOSOSCF
formula: C18H24N2O6
InChI: InChI=1/C18H24N2O6/c1-4-6-7-8-10-13(3)15-11-14(19(22)23)12-16(20(24)25)18(15)26-17(21)9-5-2/h5,9,11-13H,4,6-8,10H2,1-3H3
50 atoms
O  -1.351664 1.027842 -0.089236
O  -0.306945 2.26879 2.065283
O  1.680197 2.96859 1.677102
O  4.687611 -0.485475 0.177801
O  3.963473 -1.981239 -1.17301
O  -0.75146 3.049722 -0.863382
N  0.758229 2.216074 1.502473
N  3.816397 -1.02036 -0.459625
C  -0.937706 -1.203967 -1.823756
C  -2.109697 -1.766183 -1.004849
C  -1.722754 -2.575062 0.229171
C  -0.856562 -3.794711 -0.062371
C  0.145855 -0.541266 -0.998053
C  -0.637899 -4.698587 1.149247
C  -1.434335 -0.311749 -2.962955
C  0.010878 -4.022159 2.355888
C  -0.084749 0.556417 -0.165431
C  1.437539 -1.042475 -1.071908
C  0.96831 1.115306 0.563341
C  2.469771 -0.46328 -0.356348
C  2.254665 0.62401 0.462833
C  1.350999 -3.366699 2.051371
C  -1.603228 2.326996 -0.440373
C  -3.02222 2.631792 -0.246008
C  -3.502667 3.832567 -0.566545
C  -4.917895 4.250752 -0.40317
H  -0.447963 -2.059662 -2.298406
H  -2.690673 -2.40136 -1.681532
H  -2.779648 -0.95725 -0.709173
H  -2.643491 -2.90443 0.720995
H  -1.223945 -1.925034 0.954288
H  0.116177 -3.484293 -0.456222
H  -1.322958 -4.383889 -0.858845
H  -1.598641 -5.123772 1.456019
H  -0.01778 -5.546529 0.842968
H  -0.607498 0.087667 -3.549747
H  -2.066977 -0.89263 -3.63525
H  -2.031244 0.526511 -2.607002
H  -0.669185 -3.278089 2.779575
H  0.146329 -4.773171 3.138275
H  1.638212 -1.894355 -1.706787
H  3.061678 1.077189 1.01962
H  1.240673 -2.512836 1.381339
H  1.826686 -3.000365 2.961145
H  2.041414 -4.067765 1.578496
H  -3.657118 1.859643 0.170775
H  -2.818095 4.569853 -0.974212
H  -4.983247 5.117695 0.257144
H  -5.338485 4.561514 -1.36153
H  -5.541838 3.458815 0.007059
totalener: -1261.15492989 hartree
nucrepener: 2509.99438781 hartree
electener: -3771.14931770 hartree
oneelecener: -6707.12214581 hartree
twoeener: 2935.97282812 hartree
kineticenergy: 1256.03523534 hartree
xcener: -118.903290467469 hartree
chargesum: 0.0000000
charge: -0.274519 -0.321882 -0.313558 -0.327742 -0.333446 -0.319291 0.505688 0.532023 0.058576 -0.215977 -0.104712 -0.131564 0.069916 -0.156760 -0.284676 -0.120151 0.105503 -0.106185 0.066998 -0.099707 -0.032148 -0.216705 0.347643 -0.238164 -0.009077 -0.198265 0.055738 0.085643 0.084362 0.083885 0.071361 0.063452 0.079842 0.069196 0.077010 0.106887 0.096715 0.085334 0.062006 0.073295 0.144609 0.164439 0.014410 0.095893 0.090167 0.107825 0.129773 0.099677 0.095315 0.081349
qa: -0.2745 -0.3219 -0.3136 -0.3277 -0.3334 -0.3193 0.5057 0.5320 0.0586 -0.2160 -0.1047 -0.1316 0.0699 -0.1568 -0.2847 -0.1202 0.1055 -0.1062 0.0670 -0.0997 -0.0321 -0.2167 0.3476 -0.2382 -0.0091 -0.1983 0.0557 0.0856 0.0844 0.0839 0.0714 0.0635 0.0798 0.0692 0.0770 0.1069 0.0967 0.0853 0.0620 0.0733 0.1446 0.1644 0.0144 0.0959 0.0902 0.1078 0.1298 0.0997 0.0953 0.0813
va: 2.1027 1.9085 1.9361 1.9312 1.9250 2.1806 4.1400 4.1693 3.7936 3.9086 3.8450 3.8370 3.5769 3.9234 3.9440 3.8915 4.0984 3.9623 3.9134 4.0490 4.1345 3.9208 4.2146 3.9453 3.8470 3.9521 1.0117 1.0108 1.0177 1.0112 1.0098 1.0063 1.0137 1.0120 1.0080 1.0048 1.0037 1.0059 1.0034 1.0096 1.0266 1.0389 1.0107 1.0101 1.0050 1.0239 1.0191 0.9985 0.9989 1.0107
dispcorr: -0.028207849 hartree
energy: -1261.183137741406
dipole: -29.20204 26.51048 -2.69157 -25.90429 25.42143 -0.48286 -2.45497 1.69753 -0.75744
magnitude: 2.83750 au
magnitude: 7.21235 debye
