program: Orca
programVersion: 4.2.1
elementType: O O O O O O N N C C C C C C C C C C C C C C C C C C H H H H H H H H H H H H H H H H H H H H H H H H
charge: 0
multiplicity: 1
keywords: wb97x-d3
keywords: def2-TZVPP
keywords: def2/J RIJCOSX GRIDX6 NOFINALGRIDX
keywords: grid4 nofinalgrid
keywords: scfconv7
keywords: smallprint printgap noloewdin
keywords: NOSOSCF
formula: C18H24N2O6
InChI: InChI=1/C18H24N2O6/c1-4-6-7-8-10-13(3)15-11-14(19(22)23)12-16(20(24)25)18(15)26-17(21)9-5-2/h5,9,11-13H,4,6-8,10H2,1-3H3
50 atoms
O  -0.898278 1.223663 0.467707
O  2.144918 3.763891 -0.202848
O  0.106683 3.398458 -0.749401
O  4.358878 -1.963931 -0.382791
O  5.066108 0.000303 -0.859534
O  -0.224455 2.493875 2.191695
N  1.19655 3.043826 -0.374829
N  4.209484 -0.775212 -0.518785
C  -0.490667 -1.55359 0.851687
C  -0.734814 -2.66208 -0.178453
C  -1.197263 -2.147218 -1.535271
C  -1.336276 -3.238234 -2.594416
C  0.589745 -0.598416 0.395146
C  -2.296538 -4.373984 -2.249107
C  -0.141639 -2.130647 2.22428
C  -3.72558 -3.925224 -1.9681
C  0.357749 0.768517 0.241879
C  1.861856 -1.085727 0.128422
C  1.401163 1.613014 -0.152286
C  2.878423 -0.232542 -0.253654
C  2.669421 1.125166 -0.388329
C  -4.675233 -5.095753 -1.757873
C  -1.101135 2.145584 1.458589
C  -2.49986 2.578636 1.463125
C  -2.921289 3.485354 2.34352
C  -4.308226 4.009886 2.422123
H  -1.424759 -0.999231 0.954478
H  -1.486995 -3.33783 0.239048
H  0.169455 -3.269743 -0.299386
H  -0.487623 -1.402569 -1.907039
H  -2.145089 -1.613857 -1.414098
H  -0.347493 -3.661235 -2.796929
H  -1.659616 -2.773798 -3.5307
H  -2.305474 -5.081989 -3.083514
H  -1.919509 -4.941698 -1.392122
H  -0.950844 -2.765905 2.5858
H  0.762336 -2.740874 2.188538
H  0.019529 -1.342486 2.959651
H  -3.749765 -3.280257 -1.084519
H  -4.081836 -3.30833 -2.799119
H  2.064119 -2.143093 0.22942
H  3.469772 1.790376 -0.677123
H  -4.35786 -5.717985 -0.919262
H  -5.69065 -4.757914 -1.550357
H  -4.715281 -5.735475 -2.640876
H  -3.166206 2.155152 0.721925
H  -2.206216 3.884309 3.056209
H  -4.313789 5.090419 2.265888
H  -4.968444 3.553806 1.686685
H  -4.726786 3.840256 3.415953
totalener: -1261.15777176 hartree
nucrepener: 2406.59281148 hartree
electener: -3667.75058324 hartree
oneelecener: -6500.27376118 hartree
twoeener: 2832.52317793 hartree
kineticenergy: 1256.04099314 hartree
xcener: -118.901785493421 hartree
chargesum: -0.0000000
charge: -0.286618 -0.314214 -0.321202 -0.333249 -0.327718 -0.325597 0.501633 0.511104 0.055921 -0.199263 -0.112524 -0.171718 -0.028723 -0.123973 -0.268621 -0.095517 0.187410 -0.054045 0.076040 -0.117268 -0.046454 -0.256607 0.377416 -0.239046 -0.013913 -0.198482 0.059005 0.079402 0.079996 0.084389 0.076551 0.076737 0.078578 0.074927 0.063828 0.091073 0.084097 0.107504 0.048980 0.064168 0.145911 0.166407 0.073123 0.085551 0.075275 0.105241 0.128786 0.099697 0.081492 0.094515
qa: -0.2866 -0.3142 -0.3212 -0.3332 -0.3277 -0.3256 0.5016 0.5111 0.0559 -0.1993 -0.1125 -0.1717 -0.0287 -0.1240 -0.2686 -0.0955 0.1874 -0.0540 0.0760 -0.1173 -0.0465 -0.2566 0.3774 -0.2390 -0.0139 -0.1985 0.0590 0.0794 0.0800 0.0844 0.0766 0.0767 0.0786 0.0749 0.0638 0.0911 0.0841 0.1075 0.0490 0.0642 0.1459 0.1664 0.0731 0.0856 0.0753 0.1052 0.1288 0.0997 0.0815 0.0945
va: 2.0963 1.9352 1.9082 1.9257 1.9287 2.1781 4.1435 4.1760 3.8115 3.8833 3.8307 3.9201 3.6625 3.8586 3.9407 3.8672 4.0473 4.0296 3.9147 4.1481 4.1421 3.9551 4.1954 3.9495 3.8500 3.9518 1.0311 1.0091 1.0129 1.0150 1.0056 1.0090 1.0084 1.0115 1.0040 1.0058 1.0032 1.0076 1.0053 1.0078 1.0292 1.0381 1.0028 1.0054 1.0042 1.0261 1.0185 0.9983 1.0102 0.9993
dispcorr: -0.024073445 hartree
energy: -1261.181845205015
dipole: -45.53336 42.85522 -2.67815 -36.00857 35.21672 -0.79185 -3.33902 3.85609 0.51707
magnitude: 2.84022 au
magnitude: 7.21927 debye
