program: Orca
programVersion: 4.2.1
elementType: O O O O O O N N C C C C C C C C C C C C C C C C C C H H H H H H H H H H H H H H H H H H H H H H H H
charge: 0
multiplicity: 1
keywords: wb97x-d3
keywords: def2-TZVPP
keywords: def2/J RIJCOSX GRIDX6 NOFINALGRIDX
keywords: grid4 nofinalgrid
keywords: scfconv7
keywords: smallprint printgap noloewdin
keywords: NOSOSCF
formula: C18H24N2O6
InChI: InChI=1/C18H24N2O6/c1-4-6-7-8-10-13(3)15-11-14(19(22)23)12-16(20(24)25)18(15)26-17(21)9-5-2/h5,9,11-13H,4,6-8,10H2,1-3H3
50 atoms
O  -0.754066 0.570809 0.01674
O  1.685771 3.736371 -0.400763
O  -0.109138 2.88456 -1.200668
O  5.15294 -1.32118 0.025777
O  5.454249 0.742794 -0.458156
O  -0.656939 2.049698 1.704247
N  0.964869 2.808249 -0.657341
N  4.757342 -0.202927 -0.190805
C  0.181338 -2.008736 0.575069
C  -0.328858 -2.620484 -0.741318
C  -1.298052 -3.790533 -0.581286
C  -2.544423 -3.497756 0.252968
C  1.103818 -0.852106 0.255662
C  -3.367824 -2.298787 -0.208564
C  0.840864 -3.052904 1.471822
C  -3.923487 -2.416555 -1.622311
C  0.591819 0.420815 -0.013781
C  2.476038 -1.035597 0.175118
C  1.457386 1.473075 -0.321847
C  3.314513 0.02227 -0.126393
C  2.824777 1.288612 -0.36469
C  -4.778753 -1.21937 -2.011955
C  -1.309159 1.474132 0.885939
C  -2.751091 1.572345 0.654299
C  -3.502696 2.381451 1.399309
C  -4.966269 2.565794 1.228905
H  -0.675068 -1.609241 1.124379
H  0.535293 -2.959399 -1.321916
H  -0.798841 -1.83641 -1.341585
H  -0.776628 -4.646923 -0.14553
H  -1.594414 -4.116748 -1.581825
H  -2.261265 -3.34693 1.299523
H  -3.177996 -4.389851 0.250833
H  -4.199715 -2.158196 0.488659
H  -2.766771 -1.387441 -0.135091
H  1.310547 -2.594917 2.342613
H  0.098753 -3.759351 1.84087
H  1.598121 -3.637088 0.945701
H  -3.105143 -2.520206 -2.340397
H  -4.514833 -3.333633 -1.70476
H  2.902443 -2.009247 0.366532
H  3.484653 2.114107 -0.587422
H  -4.196712 -0.295651 -1.992456
H  -5.184947 -1.323784 -3.017919
H  -5.620342 -1.093805 -1.328213
H  -3.180575 0.98367 -0.146794
H  -3.022719 2.958252 2.183724
H  -5.193463 3.60924 1.001683
H  -5.372771 1.944508 0.432679
H  -5.49314 2.330167 2.155533
totalener: -1261.15650155 hartree
nucrepener: 2468.73881683 hartree
electener: -3729.89531838 hartree
oneelecener: -6624.41395450 hartree
twoeener: 2894.51863612 hartree
kineticenergy: 1256.02923528 hartree
xcener: -118.903626993400 hartree
chargesum: 0.0000000
charge: -0.288390 -0.313355 -0.321578 -0.334416 -0.328137 -0.318946 0.501224 0.511808 0.082229 -0.180765 -0.181833 -0.155512 0.019551 -0.071261 -0.319959 -0.088119 0.148006 -0.077252 0.053304 -0.108821 -0.038644 -0.283108 0.373568 -0.228108 -0.011476 -0.195841 0.067374 0.099340 0.091615 0.086612 0.088601 0.074074 0.080266 0.081473 -0.004706 0.120007 0.092579 0.087869 0.056593 0.064196 0.157172 0.166849 0.079519 0.096593 0.077997 0.088879 0.128919 0.099636 0.080300 0.094074
qa: -0.2884 -0.3134 -0.3216 -0.3344 -0.3281 -0.3189 0.5012 0.5118 0.0822 -0.1808 -0.1818 -0.1555 0.0196 -0.0713 -0.3200 -0.0881 0.1480 -0.0773 0.0533 -0.1088 -0.0386 -0.2831 0.3736 -0.2281 -0.0115 -0.1958 0.0674 0.0993 0.0916 0.0866 0.0886 0.0741 0.0803 0.0815 -0.0047 0.1200 0.0926 0.0879 0.0566 0.0642 0.1572 0.1668 0.0795 0.0966 0.0780 0.0889 0.1289 0.0996 0.0803 0.0941
va: 2.1059 1.9361 1.9058 1.9222 1.9291 2.1883 4.1418 4.1739 3.7121 3.8343 3.8833 3.9131 3.7201 3.8702 3.9625 3.8537 4.1160 4.0339 3.9362 4.1567 4.1327 3.9566 4.1975 3.9270 3.8470 3.9498 1.0147 1.0117 1.0118 1.0058 1.0034 1.0074 1.0112 1.0103 1.0268 1.0040 1.0026 1.0006 1.0065 1.0089 1.0247 1.0376 0.9995 1.0075 1.0012 1.0370 1.0166 0.9993 1.0103 0.9999
dispcorr: -0.026849490 hartree
energy: -1261.183351039033
dipole: -48.40469 45.83526 -2.56942 -31.04588 29.61867 -1.42722 -0.69797 0.92368 0.22571
magnitude: 2.94785 au
magnitude: 7.49285 debye
