program: Gaussian 09
title: 000074374
version: EM64L-G09RevD.01
frameworkgroup: C1[X(C8H7ClO2)]
method: RPBEPBE
basis: SDD
operation: Freq
keyword: #p
keyword: freq=noraman
keyword: PBEPBE/SDD
title: #p freq=noraman PBEPBE/SDD
converged: NO YES NO NO
title: Mulliken charges:
elementType: Cl O O C C C C C C C C H H H H H H H
charge: -0.107149 -0.263860 -0.108738 0.359650 0.440505 -0.482044 -0.346592 -0.325777 -0.205387 -0.173665 -0.535809 0.293054 0.251366 0.267020 0.235043 0.224657 0.224656 0.253069
chargesum: 0.00000
title: Mulliken charges with hydrogens summed into heavy atoms:
elementType: Cl O O C C C C C C C C
charge: -0.107149 -0.263860 -0.108738 0.359650 0.440505 -0.188990 -0.095226 -0.058756 0.029656 -0.173665 0.166574
polarizability: 1.60166847e+02 -3.63360048e+00 1.10058074e+02 -3.89070593e-05 -1.61515699e-03 4.40294220e+01
1716.lowfreq: -13.9871 -2.3819 -0.0021 -0.0021 -0.0015 4.3346 36.4268 86.4336 144.4094
frequency: 36.4173 86.4310 144.4058 158.1712 204.2011 237.9112 265.4947 269.3747 381.3126 420.5270 435.7158 504.3720 514.9246 543.6849 648.8034 659.0137 690.3159 738.0566 800.7164 899.7482 910.7889 923.7457 980.7734 984.0938 1020.6833 1097.5869 1111.9241 1142.8566 1162.6053 1192.5379 1247.5592 1293.1910 1401.9377 1424.7927 1438.1390 1470.1331 1471.4825 1474.9694 1584.7660 1610.1197 1713.6099 2966.0982 3056.7301 3136.1326 3147.8750 3172.3788 3175.6432 3190.3125
redmass: 9.4417 3.5092 6.6704 4.2375 1.8264 8.3834 1.6728 4.0906 14.0849 3.5158 6.2867 6.9838 4.6563 5.0377 8.0972 4.4485 2.3808 7.1711 1.5157 1.4468 6.6850 1.4702 5.8939 1.3348 3.5257 1.6859 1.2586 1.7392 1.4261 1.1833 4.9232 1.3235 9.1212 2.4975 1.3043 1.0495 1.1715 1.9683 6.0917 6.6167 12.9428 1.0330 1.1044 1.0995 1.0878 1.0934 1.0924 1.0962
irintensity: 0.0221 4.4682 0.3620 1.8029 1.2654 1.1891 0.7994 16.9396 7.3237 0.3505 9.9417 0.0776 5.2743 2.2665 71.4415 0.0210 43.3479 157.8025 45.2014 3.0903 130.3574 23.3896 1.0087 0.5373 11.6889 9.4494 0.1743 14.5773 7.6786 3.1472 391.2432 3.4740 15.9521 82.3537 8.6933 14.8469 48.4146 25.9496 63.9841 26.4837 272.5186 56.8093 44.7785 20.0253 7.8517 7.6326 3.3252 5.5882
temp: 298.150 k
press: 1.00000 atm
elementType: 17 8 8 6 6 6 6 6 6 6 6 1 1 1 1 1 1 1
symmnumber: 1
zpe: 341791.4 jmol-1
zpe.correction: 0.130181 hartree
zpe.thermalcorrener: 0.140430 hartree
zpe.thermalcorrenthalpy: 0.141374 hartree
zpe.thermalcorrgfe: 0.093316 hartree
zpe.sumelectzpe: -918.755900 hartree
zpe.sumelectthermal: -918.745652 hartree
zpe.sumelectthermalent: -918.744708 hartree
zpe.sumelectthermalfe: -918.792766 hartree
dipole: 5.8895 3.1139 -0.0006
dipole: 6.6620
quadrupole: -64.5383 -70.4739 -72.5807
quadrupole: -0.6816 0.0031 -0.0003
quadrupole: 4.6593 -1.2763 -3.3831 -0.6816 0.0031 -0.0003
hfenergy: -918.8860818 hartree
pointgroup: C01[X(C8H7Cl1O2)]
dipole: 2.3736534 1.1115683 -0.0002445 debye
dipolederiv: -0.935505 0.3208314 0.0001906 0.4892901 -0.4597869 -0.0001591 0.0004106 -0.0002129 -0.1515792 -1.5410909 0.4015884 -0.0001565 0.6292681 -0.4967656 0.0000858 -0.0002014 0.0000733 -0.3023121 -0.6702193 -0.1376042 0.0000024 -0.0802185 -1.1503918 -0.0002948 0.0000408 0.0002575 -0.2313678 1.0916371 -0.6627002 0.0001646 -0.9958542 0.2841545 -0.000121 0.0002176 -0.000115 0.1128577 -0.753044 -0.3245826 0.0000637 -0.1367702 -0.010538 -0.0000713 -0.0000284 -0.0000614 0.0135405 -0.1926131 0.395875 -0.0000356 -0.219297 -0.0096594 0.0000022 -0.0001038 0.0000137 -0.1271222 -0.0735131 -0.0258984 0.0000225 0.3590187 -0.1129911 0.0000349 -0.000026 -0.0000101 -0.1818679 -0.0585414 -0.0991595 0.0000398 0.2194706 -0.1536016 0.000019 -0.0000692 -0.00001 -0.1480696 -0.0394178 0.1273698 -0.0000016 -0.0061219 0.2102589 -0.0000338 0.0000288 0.0000127 -0.1211383 2.1704506 -0.0050248 -0.0002774 -0.285228 1.5743438 0.0004759 -0.0002785 0.0000255 0.1896571 0.8740113 -0.0784585 0.0000612 0.209506 0.189092 0.0000324 0.0000514 0.000009 0.3262002 0.1368903 -0.0283054 -0.000011 0.0124518 0.0342608 0.0000122 -0.0000015 0.0000093 0.1720241 -0.0640885 -0.0612691 -0.0000196 -0.0649719 0.0919547 -0.0000004 -0.0000334 -0.0000046 0.1645787 0.0561157 0.0713514 -0.0000284 0.0469839 0.0840086 0.000015 -0.0000259 -0.0000116 0.1700555 0.0691561 -0.0178128 -0.0000016 -0.0267662 -0.0972173 0.0000239 0.0000089 0.0000164 0.1546116 -0.0207548 0.0190656 0.0040023 -0.1453823 0.0238416 -0.1214135 -0.0521541 -0.0930097 -0.0835393 -0.0207661 0.0190414 -0.0039917 -0.1454005 0.0238778 0.121365 0.052194 0.0929955 -0.0835673 -0.028707 0.0856925 -0.0000236 0.1400214 -0.0248409 0.0000278 -0.0000299 0.0000224 0.1270383 unknown
polarizability: 159.6983426|-6.0381915|110.5265793|-0.000117|-0.0016114|44.029422 unknown
InChI: InChI=1S/C8H7ClO2/c1-11-7-4-2-3-6(5-7)8(9)10/h2-5H,1H3
charge 0 multiplicity 1
18 atoms
Cl -3.779457 0.54819 0.00042
O  2.540104 -1.120857 0.000276
O  -2.487321 -1.848022 -0.000038
C  1.480102 -0.207957 0.000065
C  -0.955818 0.051047 -0.000259
C  0.190138 -0.784681 -0.000045
C  1.629029 1.20321 -0.000043
C  -0.814364 1.464634 -0.000354
C  0.476895 2.022818 -0.000255
C  -2.269969 -0.637979 -0.000408
C  3.905938 -0.583004 0.000385
H  0.086363 -1.873447 0.000019
H  2.620088 1.665444 0.000036
H  -1.702677 2.099815 -0.000502
H  0.596533 3.111136 -0.000339
H  4.098469 0.022913 0.90651
H  4.098674 0.022755 -0.905801
H  4.557073 -1.468215 0.000534
