program: Orca
programVersion: 4.2.1
elementType: O O O O O O N N C C C C C C C C C C C C C C C C C C H H H H H H H H H H H H H H H H H H H H H H H H
charge: 0
multiplicity: 1
keywords: wb97x-d3
keywords: def2-TZVPP
keywords: def2/J RIJCOSX GRIDX6 NOFINALGRIDX
keywords: grid4 nofinalgrid
keywords: scfconv7
keywords: smallprint printgap noloewdin
keywords: NOSOSCF
formula: C18H24N2O6
InChI: InChI=1/C18H24N2O6/c1-4-6-7-8-10-13(3)15-11-14(19(22)23)12-16(20(24)25)18(15)26-17(21)9-5-2/h5,9,11-13H,4,6-8,10H2,1-3H3
50 atoms
O  -0.569019 1.148785 0.352985
O  0.338496 3.394177 -0.829852
O  2.3122 3.906175 -0.173934
O  4.927789 -1.656506 -0.251872
O  5.518825 0.352946 -0.696306
O  -0.086773 2.505689 2.076234
N  1.429142 3.119711 -0.394752
N  4.702709 -0.480622 -0.395198
C  -0.03169 -1.556612 0.724626
C  -0.767538 -1.995362 -0.551959
C  -1.992775 -2.86401 -0.296465
C  -2.772878 -3.163157 -1.570798
C  1.045221 -0.557992 0.363161
C  -4.001859 -4.030029 -1.331506
C  0.508855 -2.745179 1.514961
C  -4.794173 -4.31643 -2.600831
C  0.727775 0.792796 0.189929
C  2.355771 -0.95621 0.150706
C  1.723616 1.707613 -0.157021
C  3.32718 -0.031247 -0.188704
C  3.033333 1.30782 -0.333834
C  -6.020237 -5.182498 -2.351786
C  -0.895757 2.067048 1.314917
C  -2.327589 2.367271 1.254436
C  -2.868758 3.240465 2.102644
C  -4.300784 3.63286 2.115846
H  -0.756488 -1.04836 1.366522
H  -0.064378 -2.528451 -1.201265
H  -1.078235 -1.107733 -1.109964
H  -2.650117 -2.360505 0.421258
H  -1.699738 -3.8085 0.17102
H  -2.114396 -3.65724 -2.293182
H  -3.0782 -2.221323 -2.039056
H  -3.696006 -4.977038 -0.8737
H  -4.654517 -3.541206 -0.599831
H  1.101667 -3.421743 0.89669
H  1.12729 -2.422144 2.352721
H  -0.311597 -3.330402 1.926734
H  -5.100781 -3.37041 -3.0572
H  -4.143191 -4.804785 -3.332106
H  2.631134 -1.994291 0.266037
H  3.798603 2.026946 -0.586313
H  -6.572274 -5.370303 -3.272753
H  -5.742799 -6.150661 -1.93189
H  -6.705787 -4.705951 -1.649106
H  -2.919745 1.874141 0.493559
H  -2.224709 3.712502 2.8380
H  -4.401149 4.706232 1.944062
H  -4.883227 3.108922 1.36028
H  -4.74375 3.434801 3.093543
totalener: -1261.15945428 hartree
nucrepener: 2356.89143611 hartree
electener: -3618.05089038 hartree
oneelecener: -6400.85330475 hartree
twoeener: 2782.80241436 hartree
kineticenergy: 1256.03754335 hartree
xcener: -118.898701908933 hartree
chargesum: 0.0000000
charge: -0.291807 -0.322198 -0.313853 -0.334392 -0.328074 -0.321637 0.502247 0.511634 0.120765 -0.177864 -0.121136 -0.112974 0.010178 -0.106972 -0.318181 -0.083191 0.140452 -0.078180 0.060501 -0.107611 -0.042100 -0.259426 0.375924 -0.241323 -0.013573 -0.197478 0.057587 0.080180 0.084174 0.063382 0.064501 0.059735 0.057927 0.054582 0.052211 0.083536 0.120516 0.098875 0.053122 0.054800 0.156307 0.166490 0.086429 0.073765 0.072298 0.104761 0.129761 0.099640 0.081061 0.094632
qa: -0.2918 -0.3222 -0.3139 -0.3344 -0.3281 -0.3216 0.5022 0.5116 0.1208 -0.1779 -0.1211 -0.1130 0.0102 -0.1070 -0.3182 -0.0832 0.1405 -0.0782 0.0605 -0.1076 -0.0421 -0.2594 0.3759 -0.2413 -0.0136 -0.1975 0.0576 0.0802 0.0842 0.0634 0.0645 0.0597 0.0579 0.0546 0.0522 0.0835 0.1205 0.0989 0.0531 0.0548 0.1563 0.1665 0.0864 0.0738 0.0723 0.1048 0.1298 0.0996 0.0811 0.0946
va: 2.1055 1.9067 1.9357 1.9225 1.9289 2.1848 4.1409 4.1741 3.7328 3.8690 3.8654 3.8991 3.7564 3.8839 3.9412 3.8916 4.1110 4.0402 3.9136 4.1509 4.1355 3.9536 4.2032 3.9517 3.8482 3.9517 1.0236 1.0129 1.0199 1.0101 1.0115 1.0123 1.0135 1.0109 1.0107 1.0006 1.0023 0.9999 1.0077 1.0077 1.0241 1.0379 1.0060 1.0030 1.0030 1.0249 1.0184 0.9984 1.0103 0.9994
dispcorr: -0.022584637 hartree
energy: -1261.182038913311
dipole: -55.56806 52.83566 -2.73239 -39.30271 38.28904 -1.01366 -4.26103 4.68195 0.42091
magnitude: 2.94460 au
magnitude: 7.48457 debye
