program: Gaussian 09
title: 000074373
version: EM64L-G09RevD.01
frameworkgroup: C1[X(C7H4ClIO)]
method: RPBEPBE
basis: SDD
operation: Freq
keyword: #p
keyword: freq=noraman
keyword: PBEPBE/SDD
title: #p freq=noraman PBEPBE/SDD
converged: NO YES NO NO
title: Mulliken charges:
elementType: I Cl O C C C C C C C H H H H
charge: 0.153658 -0.099312 -0.107752 0.420420 -0.338352 -0.283446 -0.147909 -0.147096 -0.347226 -0.175685 0.278449 0.271825 0.261944 0.260482
chargesum: 0.00000
title: Mulliken charges with hydrogens summed into heavy atoms:
elementType: I Cl O C C C C C C C
charge: 0.153658 -0.099312 -0.107752 0.420420 -0.059902 -0.011622 0.114034 0.113386 -0.347226 -0.175685
polarizability: 2.07483929e+02 -1.59116930e-01 1.02951161e+02 -6.65961696e-03 -1.11909763e-02 3.52924248e+01
1716.lowfreq: -7.8547 -0.0027 -0.0021 -0.0010 6.9474 7.1413 48.4010 68.3612 119.3180
frequency: 48.4008 68.3574 119.3178 186.2709 230.4174 247.1810 339.7759 394.1159 401.6473 456.8759 509.1241 619.2837 622.7794 673.6506 720.9755 838.9533 842.4302 851.2174 981.3005 988.9978 993.4934 1054.2206 1121.1226 1187.4219 1208.8583 1296.0543 1364.5658 1396.5200 1462.0926 1559.9577 1588.0400 1709.4791 3156.9893 3165.9089 3178.6373 3184.8877
redmass: 6.3708 9.2771 14.1473 21.5144 7.1416 7.0560 7.6794 15.0022 2.8538 3.8373 8.5159 7.1680 4.9705 8.2973 3.8114 7.4977 1.2455 1.5347 1.3469 1.3789 5.2248 2.6515 1.3761 1.4628 2.1538 1.2472 4.3201 4.3055 2.2465 7.4700 6.1861 12.9347 1.0893 1.0889 1.0967 1.0975
irintensity: 0.0916 1.5048 2.0767 0.6811 2.1999 0.5345 36.4093 4.9300 0.0008 13.1005 20.6725 5.4243 27.2142 43.5834 5.4296 282.1768 0.0006 60.8459 1.3936 0.0885 44.6467 43.3138 5.9959 124.8906 89.5889 0.5964 6.5227 27.1555 31.4144 42.7885 178.2700 317.9435 0.1783 1.0126 2.6941 1.6055
temp: 298.150 k
press: 1.00000 atm
elementType: 53 17 8 6 6 6 6 6 6 6 1 1 1 1
symmnumber: 1
zpe: 231892.0 jmol-1
zpe.correction: 0.088323 hartree
zpe.thermalcorrener: 0.097518 hartree
zpe.thermalcorrenthalpy: 0.098462 hartree
zpe.thermalcorrgfe: 0.050903 hartree
zpe.sumelectzpe: -815.239115 hartree
zpe.sumelectthermal: -815.229919 hartree
zpe.sumelectthermalent: -815.228975 hartree
zpe.sumelectthermalfe: -815.276535 hartree
dipole: 3.5407 -0.2952 0.0003
dipole: 3.5529
quadrupole: -97.8045 -73.8393 -81.2177
quadrupole: 2.9987 -0.0017 -0.0018
quadrupole: -13.5173 10.4479 3.0694 2.9987 -0.0017 -0.0018
hfenergy: -815.3274376 hartree
pointgroup: C01 [X(C7H4Cl1I1O1)]
dipole: 1.396524 0.0605339 -0.0001345 debye
dipolederiv: -0.6493844 -0.0194148 -0.0000141 -0.0311973 0.0123494 0.0000615 -0.0004228 0.0000059 0.0359175 -0.634408 0.3501354 -0.0000162 0.6051693 -0.7803679 0.0000326 0.0000608 -0.0000317 -0.1458509 -0.909415 -0.2998055 -0.0000223 -0.3147154 -1.0233007 0.0000024 0.0002032 0.0002825 -0.2328048 -1.1137635 -0.0048649 -0.0000016 0.1568271 -0.15907 0.0000247 -0.0000162 0.0000113 0.0141363 0.3165574 0.1722349 -0.0000163 -0.3597112 0.0440448 -0.0000427 -0.000038 -0.0000124 -0.0886011 0.3289222 -0.1141752 0.0000364 0.3292444 -0.0192931 -0.0000214 -0.0001002 -0.000013 -0.0909513 -0.6623373 -0.2705506 0.0000218 -0.1959795 -0.0226308 -0.0000262 -0.0000606 -0.0000474 -0.088557 -0.6944377 0.2320048 -0.000065 0.1740982 0.0306839 -0.0000316 -0.0000942 -0.0000054 -0.0842311 1.4994038 0.0483253 0.0000713 0.0714787 0.0959466 -0.0000949 0.0005447 -0.0000487 -0.1532021 2.2766119 -0.0933867 0.0000288 -0.4351016 1.7311346 -0.0000383 -0.0001533 -0.000263 0.1882626 0.0601673 -0.0777782 0.0000049 -0.0220878 0.0340728 0.0000346 0.0000281 0.0000323 0.1621233 0.0810877 0.0610694 -0.0000279 0.0223913 0.048659 0.0000282 0.0000142 0.0000154 0.1600749 0.0432095 0.0750969 -0.0000226 0.0584612 0.0105864 0.0000406 0.0000153 0.0000443 0.1631119 0.0577861 -0.0588908 0.0000227 -0.0588773 -0.002815 0.0000307 0.000019 0.0000301 0.1605719 unknown
polarizability: 207.3304997|-4.0050146|103.1045896|0.0062082|-0.0114476|35.2924248 unknown
InChI: InChI=1S/C7H4ClIO/c8-7(10)5-1-3-6(9)4-2-5/h1-4H
charge 0 multiplicity 1
14 atoms
I  4.214902 0.152214 0.000165
Cl -3.178297 1.430855 -0.000146
O  -2.860343 -1.275179 0.000174
C  -0.742667 -0.072579 -0.00014
C  0.02915 -1.27069 0.000182
C  -0.085249 1.183546 -0.000392
C  1.434892 -1.213826 0.000275
C  1.322155 1.248148 -0.000309
C  2.072641 0.049883 0.000025
C  -2.215726 -0.227333 -0.000212
H  -0.485199 -2.237032 0.000375
H  -0.675545 2.103855 -0.000631
H  2.022733 -2.135538 0.000536
H  1.825154 2.218376 -0.000502
