program: Orca
programVersion: 4.2.1
elementType: O O O O O O N N C C C C C C C C C C C C C C C C C C H H H H H H H H H H H H H H H H H H H H H H H H
charge: 0
multiplicity: 1
keywords: wb97x-d3
keywords: def2-TZVPP
keywords: def2/J RIJCOSX GRIDX6 NOFINALGRIDX
keywords: grid4 nofinalgrid
keywords: scfconv7
keywords: smallprint printgap noloewdin
keywords: NOSOSCF
formula: C18H24N2O6
InChI: InChI=1/C18H24N2O6/c1-4-6-7-8-10-13(3)15-11-14(19(22)23)12-16(20(24)25)18(15)26-17(21)9-5-2/h5,9,11-13H,4,6-8,10H2,1-3H3
50 atoms
O  -1.031674 0.443985 0.755703
O  0.966973 3.370337 -1.119642
O  -0.913506 2.345559 -1.144845
O  4.758148 -1.428732 -0.465724
O  4.773512 0.44329 -1.505263
O  -0.534042 2.295883 1.923786
N  0.271056 2.40877 -0.925311
N  4.242451 -0.401905 -0.830795
C  0.206597 -1.971436 1.582399
C  0.096089 -3.290262 0.801176
C  -0.569101 -3.178149 -0.567176
C  -2.042651 -2.783049 -0.525178
C  0.894783 -0.909355 0.753904
C  -2.640805 -2.49578 -1.900227
C  0.928279 -2.180676 2.913774
C  -2.112147 -1.22066 -2.551138
C  0.253187 0.26671 0.364748
C  2.204627 -1.111458 0.34019
C  0.928461 1.202213 -0.425891
C  2.859812 -0.163591 -0.42093
C  2.238396 1.006394 -0.809284
C  -2.797695 -0.908803 -3.873263
C  -1.358816 1.534441 1.515529
C  -2.806442 1.576282 1.730956
C  -3.354121 2.5600 2.442994
C  -4.808246 2.708669 2.703892
H  -0.802552 -1.632583 1.814771
H  -0.454583 -4.003131 1.423069
H  1.096543 -3.71832 0.678957
H  -0.481023 -4.142157 -1.076548
H  -0.005364 -2.472439 -1.183009
H  -2.186652 -1.898587 0.10116
H  -2.606451 -3.586895 -0.04161
H  -2.465434 -3.347965 -2.566067
H  -3.727735 -2.413574 -1.802016
H  0.392589 -2.910063 3.522195
H  1.9432 -2.557314 2.774614
H  0.993347 -1.253725 3.483278
H  -2.243592 -0.379669 -1.863751
H  -1.034824 -1.30233 -2.719921
H  2.721284 -2.018574 0.621622
H  2.754704 1.745925 -1.403467
H  -3.873401 -0.780685 -3.741275
H  -2.410555 0.008756 -4.316023
H  -2.65044 -1.712372 -4.596736
H  -3.410772 0.799135 1.279231
H  -2.701055 3.317768 2.864509
H  -5.168775 3.660264 2.308991
H  -5.395545 1.907936 2.258491
H  -5.005442 2.726411 3.777235
totalener: -1261.15723381 hartree
nucrepener: 2503.89654551 hartree
electener: -3765.05377932 hartree
oneelecener: -6694.93808670 hartree
twoeener: 2929.88430737 hartree
kineticenergy: 1256.03903329 hartree
xcener: -118.902366489007 hartree
chargesum: -0.0000000
charge: -0.285516 -0.313204 -0.323289 -0.332959 -0.327771 -0.322187 0.512017 0.511640 0.022429 -0.191857 -0.130511 -0.108908 0.023012 -0.132904 -0.275397 -0.069616 0.142022 -0.025070 0.051607 -0.118759 -0.036173 -0.263498 0.370856 -0.238570 -0.013821 -0.196994 0.058675 0.083428 0.084341 0.086362 0.068580 0.047369 0.078191 0.057383 0.065870 0.093408 0.084087 0.107069 0.052788 0.047446 0.145630 0.165906 0.072085 0.090168 0.074314 0.106553 0.129265 0.098771 0.080529 0.095203
qa: -0.2855 -0.3132 -0.3233 -0.3330 -0.3278 -0.3222 0.5120 0.5116 0.0224 -0.1919 -0.1305 -0.1089 0.0230 -0.1329 -0.2754 -0.0696 0.1420 -0.0251 0.0516 -0.1188 -0.0362 -0.2635 0.3709 -0.2386 -0.0138 -0.1970 0.0587 0.0834 0.0843 0.0864 0.0686 0.0474 0.0782 0.0574 0.0659 0.0934 0.0841 0.1071 0.0528 0.0474 0.1456 0.1659 0.0721 0.0902 0.0743 0.1066 0.1293 0.0988 0.0805 0.0952
va: 2.0652 1.9358 1.8990 1.9259 1.9290 2.1848 4.1303 4.1754 3.8176 3.9079 3.8757 3.8746 3.6536 3.9196 3.9428 3.8706 4.0561 3.9838 3.9477 4.1534 4.1148 3.9650 4.2199 3.9439 3.8545 3.9529 1.0221 1.0124 1.0124 1.0107 1.0121 1.0213 1.0126 1.0101 1.0092 1.0049 1.0046 1.0061 1.0142 1.0089 1.0292 1.0385 1.0039 1.0055 1.0019 1.0205 1.0191 0.9987 1.0109 0.9991
dispcorr: -0.026920553 hartree
energy: -1261.184154362215
dipole: -35.04227 32.83009 -2.21218 -24.79919 23.64049 -1.15870 1.39915 -0.14143 1.25772
magnitude: 2.79610 au
magnitude: 7.10712 debye
