program: Orca
programVersion: 4.2.1
elementType: O O O O O O N N C C C C C C C C C C C C C C C C C C H H H H H H H H H H H H H H H H H H H H H H H H
charge: 0
multiplicity: 1
keywords: wb97x-d3
keywords: def2-TZVPP
keywords: def2/J RIJCOSX GRIDX6 NOFINALGRIDX
keywords: grid4 nofinalgrid
keywords: scfconv7
keywords: smallprint printgap noloewdin
keywords: NOSOSCF
formula: C18H24N2O6
InChI: InChI=1/C18H24N2O6/c1-4-6-7-8-10-13(3)15-11-14(19(22)23)12-16(20(24)25)18(15)26-17(21)9-5-2/h5,9,11-13H,4,6-8,10H2,1-3H3
50 atoms
O  -0.537896 1.256303 1.442032
O  1.557607 3.54662 -1.120976
O  0.555777 3.597559 0.770626
O  4.720324 -0.027954 -1.642563
O  4.263212 -1.954163 -0.826202
O  -1.580734 1.636534 -0.505987
N  1.138964 3.02914 -0.118614
N  4.035743 -0.783042 -1.000389
C  -0.024881 -1.514405 1.748526
C  -0.533932 -2.65927 0.866629
C  -1.381786 -2.20789 -0.315489
C  -1.835798 -3.374603 -1.182983
C  0.863432 -0.573577 0.964802
C  -2.69001 -2.949481 -2.369899
C  0.708892 -2.041637 2.982051
C  -3.113811 -4.118943 -3.249404
C  0.562979 0.779735 0.812835
C  2.020336 -1.062012 0.373266
C  1.399098 1.599396 0.047163
C  2.830957 -0.235105 -0.379438
C  2.528569 1.098558 -0.566216
C  -3.963028 -3.691388 -4.43733
C  -1.570902 1.737173 0.684456
C  -2.623821 2.345219 1.497598
C  -2.52397 2.596429 2.802475
C  -3.581208 3.257621 3.611006
H  -0.897612 -0.960595 2.098215
H  -1.121998 -3.334015 1.496534
H  0.310775 -3.257486 0.507249
H  -0.824104 -1.496216 -0.931982
H  -2.256262 -1.660492 0.051986
H  -2.394777 -4.090762 -0.570744
H  -0.955464 -3.91569 -1.546934
H  -3.580025 -2.422697 -2.00937
H  -2.137578 -2.22199 -2.97386
H  1.053806 -1.228415 3.620487
H  0.046495 -2.673763 3.574292
H  1.57817 -2.644104 2.712475
H  -2.222417 -4.643189 -3.606989
H  -3.666561 -4.845264 -2.645775
H  2.283152 -2.10443 0.488439
H  3.158065 1.737649 -1.167694
H  -4.250432 -4.544241 -5.052458
H  -4.87945 -3.196746 -4.111814
H  -3.423949 -2.99112 -5.07716
H  -3.50784 2.628432 0.939876
H  -1.617164 2.324936 3.331227
H  -3.199684 4.181455 4.049956
H  -4.46517 3.49757 3.023232
H  -3.883115 2.620992 4.444859
totalener: -1261.15874846 hartree
nucrepener: 2422.87045374 hartree
electener: -3684.02920220 hartree
oneelecener: -6532.90301669 hartree
twoeener: 2848.87381449 hartree
kineticenergy: 1256.04472829 hartree
xcener: -118.900481962498 hartree
chargesum: 0.0000000
charge: -0.285382 -0.315219 -0.321846 -0.327339 -0.332920 -0.309654 0.508295 0.510789 0.058062 -0.174939 -0.085481 -0.131341 -0.004528 -0.100891 -0.271258 -0.083467 0.167194 -0.048479 0.060328 -0.116514 -0.043339 -0.260309 0.371360 -0.235816 -0.031916 -0.193412 0.053337 0.078616 0.070860 0.073006 0.057433 0.056674 0.058486 0.053221 0.059890 0.103254 0.092161 0.085490 0.053272 0.051711 0.145772 0.165922 0.084762 0.072928 0.075175 0.113061 0.117867 0.099375 0.083371 0.092374
qa: -0.2854 -0.3152 -0.3218 -0.3273 -0.3329 -0.3097 0.5083 0.5108 0.0581 -0.1749 -0.0855 -0.1313 -0.0045 -0.1009 -0.2713 -0.0835 0.1672 -0.0485 0.0603 -0.1165 -0.0433 -0.2603 0.3714 -0.2358 -0.0319 -0.1934 0.0533 0.0786 0.0709 0.0730 0.0574 0.0567 0.0585 0.0532 0.0599 0.1033 0.0922 0.0855 0.0533 0.0517 0.1458 0.1659 0.0848 0.0729 0.0752 0.1131 0.1179 0.0994 0.0834 0.0924
va: 2.0744 1.9378 1.9075 1.9287 1.9256 2.1773 4.1377 4.1748 3.8102 3.8761 3.8482 3.9044 3.6246 3.8853 3.9422 3.8836 4.1022 4.0296 3.9418 4.1440 4.1374 3.9556 4.2356 3.9853 3.8521 3.9498 1.0296 1.0147 1.0119 1.0202 1.0159 1.0114 1.0111 1.0117 1.0120 1.0051 1.0054 1.0038 1.0077 1.0072 1.0285 1.0388 1.0056 1.0028 1.0032 1.0204 1.0219 0.9982 1.0099 0.9999
dispcorr: -0.024213930 hartree
energy: -1261.182962394577
dipole: -39.38616 37.62611 -1.76006 -32.46565 31.75366 -0.71199 0.47269 1.66710 2.13979
magnitude: 2.86067 au
magnitude: 7.27123 debye
