program: Orca
programVersion: 4.2.1
elementType: O O O O O O N N C C C C C C C C C C C C C C C C C C H H H H H H H H H H H H H H H H H H H H H H H H
charge: 0
multiplicity: 1
keywords: wb97x-d3
keywords: def2-TZVPP
keywords: def2/J RIJCOSX GRIDX6 NOFINALGRIDX
keywords: grid4 nofinalgrid
keywords: scfconv7
keywords: smallprint printgap noloewdin
keywords: NOSOSCF
formula: C18H24N2O6
InChI: InChI=1/C18H24N2O6/c1-4-6-7-8-10-13(3)15-11-14(19(22)23)12-16(20(24)25)18(15)26-17(21)9-5-2/h5,9,11-13H,4,6-8,10H2,1-3H3
50 atoms
O  -0.284365 1.129261 1.264987
O  0.938988 3.511098 1.43573
O  2.245049 3.889043 -0.21863
O  5.436868 0.407469 -1.092109
O  4.833166 -1.636857 -0.88851
O  -0.922214 2.141214 -0.634272
N  1.659175 3.157302 0.535698
N  4.645567 -0.449776 -0.791281
C  0.129881 -1.616877 0.943641
C  -0.714738 -1.896468 -0.310426
C  -1.935266 -2.77102 -0.052703
C  -2.791629 -2.967443 -1.297694
C  1.184099 -0.585934 0.608677
C  -4.007958 -3.850356 -1.050806
C  0.728352 -2.89324 1.53023
C  -4.865619 -4.059304 -2.292466
C  0.916337 0.778724 0.743858
C  2.420721 -0.967229 0.110835
C  1.876604 1.72109 0.368154
C  3.353199 -0.016608 -0.262971
C  3.095619 1.33334 -0.151325
C  -6.07502 -4.946134 -2.034443
C  -1.146306 1.875554 0.509152
C  -2.322752 2.240116 1.30096
C  -3.294391 2.976256 0.763382
C  -4.514638 3.423529 1.481554
H  -0.52988 -1.191152 1.703219
H  -0.076919 -2.364872 -1.068475
H  -1.04315 -0.948035 -0.746258
H  -2.543394 -2.319734 0.739244
H  -1.627174 -3.751582 0.321987
H  -2.179817 -3.406098 -2.093144
H  -3.118513 -1.992186 -1.673427
H  -3.67926 -4.823997 -0.671105
H  -4.62128 -3.41095 -0.256472
H  -0.057399 -3.529401 1.934375
H  1.262144 -3.483961 0.783494
H  1.41896 -2.674375 2.34492
H  -5.197517 -3.088081 -2.671471
H  -4.253093 -4.497624 -3.085987
H  2.658588 -2.015518 0.002805
H  3.824925 2.071003 -0.452048
H  -6.72421 -4.51834 -1.268675
H  -6.67398 -5.079662 -2.935378
H  -5.773652 -5.937015 -1.690776
H  -2.363372 1.91302 2.33249
H  -3.193957 3.28685 -0.271923
H  -4.548072 3.065124 2.508781
H  -4.567201 4.513975 1.49606
H  -5.412364 3.078693 0.964851
totalener: -1261.15963037 hartree
nucrepener: 2371.35791847 hartree
electener: -3632.51754884 hartree
oneelecener: -6429.82776631 hartree
twoeener: 2797.31021747 hartree
kineticenergy: 1256.03563169 hartree
xcener: -118.898780492135 hartree
chargesum: 0.0000000
charge: -0.277901 -0.321684 -0.315135 -0.327745 -0.334042 -0.325556 0.503356 0.510629 0.135887 -0.207501 -0.112379 -0.112984 0.007658 -0.106300 -0.313778 -0.082628 0.132157 -0.085062 0.065191 -0.107726 -0.041618 -0.259459 0.379342 -0.248627 -0.010792 -0.198356 0.062409 0.084207 0.088532 0.062433 0.062174 0.058868 0.061463 0.053315 0.052472 0.098310 0.083027 0.115936 0.053200 0.054722 0.155484 0.167216 0.072316 0.086360 0.073294 0.104755 0.129363 0.080978 0.099814 0.094406
qa: -0.2779 -0.3217 -0.3151 -0.3277 -0.3340 -0.3256 0.5034 0.5106 0.1359 -0.2075 -0.1124 -0.1130 0.0077 -0.1063 -0.3138 -0.0826 0.1322 -0.0851 0.0652 -0.1077 -0.0416 -0.2595 0.3793 -0.2486 -0.0108 -0.1984 0.0624 0.0842 0.0885 0.0624 0.0622 0.0589 0.0615 0.0533 0.0525 0.0983 0.0830 0.1159 0.0532 0.0547 0.1555 0.1672 0.0723 0.0864 0.0733 0.1048 0.1294 0.0810 0.0998 0.0944
va: 2.1128 1.9082 1.9359 1.9285 1.9235 2.1644 4.1413 4.1744 3.7146 3.8962 3.8439 3.8993 3.7086 3.8806 3.9379 3.8920 4.1104 4.0628 3.9586 4.1476 4.1344 3.9526 4.1831 3.9584 3.8468 3.9528 1.0259 1.0120 1.0261 1.0122 1.0133 1.0128 1.0137 1.0106 1.0105 0.9997 1.0025 1.0027 1.0080 1.0078 1.0256 1.0383 1.0029 1.0061 1.0030 1.0267 1.0184 1.0106 0.9981 0.9991
dispcorr: -0.023037284 hartree
energy: -1261.182667653471
dipole: -55.71393 53.21968 -2.49425 -38.45432 37.45583 -0.99849 -3.61200 4.65144 1.03944
magnitude: 2.88075 au
magnitude: 7.32228 debye
