program: Gaussian 09
title: 000074368
version: EM64L-G09RevD.01
frameworkgroup: C1[X(C7H10N2O2S)]
method: RPBEPBE
basis: SDD
operation: Freq
keyword: #p
keyword: freq=noraman
keyword: PBEPBE/SDD
title: #p freq=noraman PBEPBE/SDD
converged: YES YES NO NO
title: Mulliken charges:
elementType: S O O N N C C C C C C C H H H H H H H H H H
charge: 0.988723 -0.540791 -0.541704 -0.467265 -0.687380 -0.138680 -0.200136 -0.223391 0.510876 -0.397902 -0.388225 -0.610078 0.281146 0.280474 0.303568 0.230914 0.230952 0.274317 0.216425 0.248588 0.314907 0.314663
chargesum: 0.00000
title: Mulliken charges with hydrogens summed into heavy atoms:
elementType: S O O N N C C C C C C C
charge: 0.988723 -0.540791 -0.541704 -0.163697 -0.057810 -0.138680 0.081011 0.057083 0.510876 -0.166988 -0.157273 0.129251
polarizability: 1.77137365e+02 8.86653318e-01 1.13101837e+02 -1.16878847e+00 1.31176146e+01 8.64987147e+01
1716.lowfreq: -9.0159 -6.0356 -0.0018 -0.0017 0.0022 1.8825 40.0248 54.9105 82.9427
frequency: 39.9615 54.8952 82.8988 131.7412 136.4378 195.5729 209.0414 232.0684 275.3981 291.9065 321.5626 357.2903 399.5119 408.9523 413.8084 424.9377 429.8908 458.6317 518.4617 596.8643 623.0093 701.8743 718.5596 802.3843 815.7389 818.0440 834.4076 947.4014 952.1208 964.5415 981.9454 1020.8982 1028.7026 1048.1166 1094.1869 1101.9035 1129.2486 1181.6529 1296.4143 1320.1849 1329.7326 1397.1770 1414.0967 1431.7551 1462.8207 1484.4074 1488.2962 1584.1414 1613.8410 1648.1642 2933.8103 3048.7884 3096.8196 3131.6227 3133.4760 3156.2623 3160.6798 3427.1796 3562.4947 3701.3748
redmass: 3.2305 3.8805 3.8371 5.9237 2.7618 1.2535 5.4075 9.1634 5.2162 5.6396 5.1447 3.1526 3.1464 1.0546 2.6773 2.0051 2.4605 7.1010 2.7542 7.0193 6.9047 1.7300 2.6679 5.6463 7.1284 1.2653 1.8863 6.9204 1.3448 1.3843 4.8861 1.4422 2.9445 2.5172 1.4362 1.5307 1.2007 1.1185 1.3020 2.6120 1.2278 5.3692 1.1258 3.7513 1.0465 1.0971 2.6442 7.3479 4.7452 1.2279 1.0450 1.0881 1.0993 1.0887 1.0887 1.0957 1.0964 1.0761 1.0453 1.1040
irintensity: 2.0175 1.8439 1.5370 1.2554 6.8509 2.2307 2.6856 6.7887 7.5543 1.3026 18.8962 48.0344 2.1445 0.1707 0.0639 143.0860 208.6123 196.0364 35.3779 29.6555 0.3756 34.0260 4.2528 25.0136 125.9695 3.2263 64.5037 71.8179 1.1300 1.1409 4.4027 1.6469 3.1419 50.2942 20.6182 22.4861 12.1811 32.6440 4.6981 73.1697 1.5832 7.2824 12.0126 1.7740 19.4707 33.3861 54.2333 7.0530 147.1918 257.1915 59.4726 23.0368 3.6929 12.2819 11.6831 4.5284 11.7152 14.7714 104.7457 25.6283
temp: 298.150 k
press: 1.00000 atm
elementType: 16 8 8 7 7 6 6 6 6 6 6 6 1 1 1 1 1 1 1 1 1 1
symmnumber: 1
zpe: 434053.7 jmol-1
zpe.correction: 0.165322 hartree
zpe.thermalcorrener: 0.178402 hartree
zpe.thermalcorrenthalpy: 0.179346 hartree
zpe.thermalcorrgfe: 0.125580 hartree
zpe.sumelectzpe: -929.669325 hartree
zpe.sumelectthermal: -929.656246 hartree
zpe.sumelectthermalent: -929.655302 hartree
zpe.sumelectthermalfe: -929.709067 hartree
dipole: -8.1602 -3.0646 4.1503
dipole: 9.6543
quadrupole: -66.7853 -77.7838 -80.3558
quadrupole: -5.6137 7.3647 3.6290
quadrupole: 8.1897 -2.8088 -5.3809 -5.6137 7.3647 3.6290
hfenergy: -929.8346473 hartree
pointgroup: C01 [X(C7H10N2O2S1)]
dipole: -3.2704683 1.2381789 -1.4825778 debye
dipolederiv: 2.1658595 0.0027532 -0.0099853 0.029455 1.2952609 -0.2182737 -0.1842653 -0.3088873 1.4642148 -0.7411828 -0.027013 -0.0428952 -0.0911318 -0.5098378 -0.1057442 -0.07686 0.0137996 -0.6207598 -0.7210132 0.0399341 0.0037333 0.0885287 -0.7058002 0.0830436 0.0784824 -0.0602698 -0.4813573 -0.7534832 0.1325752 0.026561 0.0869175 -0.5232939 0.0947198 0.1679038 0.1259404 -0.482522 -1.7425243 0.0691636 -0.0167831 0.1290328 -0.2957042 0.2999162 -0.078698 0.3000084 -0.5305963 -0.5151949 0.0072806 -0.0182156 0.0225034 -0.3456544 -0.0168723 0.005198 0.0247034 -0.3390803 0.1701636 -0.0874176 -0.0091983 -0.283807 0.0380071 0.0523705 -0.1536585 0.0805132 -0.0117694 0.1813715 0.0320418 0.0846359 0.2330164 0.0378784 0.078716 0.2071909 0.0472882 -0.0316877 1.8393902 -0.1184237 0.0760243 -0.1556833 0.0851759 -0.0698244 0.1239014 -0.066527 0.1242593 -0.5234777 0.0193119 0.0094202 -0.300492 -0.0120255 0.1039238 -0.2516481 0.1378904 -0.133508 -0.4764177 0.0133931 -0.0009503 0.3690967 -0.0492019 0.1384365 0.2073954 0.0962657 -0.1188106 0.1785283 -0.166649 0.1086588 -0.0016007 0.3143982 -0.1177514 0.1409539 0.1471383 -0.0692716 0.1139176 -0.0565088 -0.0530027 -0.0343822 0.0806181 -0.0313202 -0.0239826 -0.0456899 0.1088826 0.1253526 0.0676007 0.031627 0.028991 0.0698886 -0.0495618 0.0160255 -0.0307963 0.1203666 0.2655006 -0.1243782 -0.071312 -0.1229527 0.0312101 0.0509267 -0.0778169 0.0039786 0.0754335 -0.0350891 0.0861353 0.043702 0.0865278 0.015098 -0.1028905 0.0264448 -0.0980295 0.1068881 -0.0495249 -0.0759189 -0.0682942 -0.0586 0.0322822 -0.0952406 -0.0679742 -0.0992305 0.1015109 0.1250605 0.0416923 -0.044143 0.0252876 0.1030996 -0.0236262 -0.0784255 -0.123233 0.0001742 -0.1203261 0.1554907 -0.1019229 0.0394807 -0.0559897 0.0522491 -0.0800687 0.0039588 0.0780233 0.0356161 -0.024127 0.0848268 -0.0872781 -0.0162328 0.1186104 0.1113566 0.0929016 0.0314103 0.2360458 -0.0077891 -0.0263067 -0.0488904 0.2112482 -0.1213033 -0.038067 -0.122464 0.300031 0.2414277 0.0208528 -0.0061799 0.0459803 0.199575 -0.120504 0.0266122 -0.1192595 0.3081684 unknown
polarizability: 177.1390522|1.1205624|110.9121419|-0.7342294|15.0245804|88.686723 unknown
InChI: InChI=1S/C7H10N2O2S/c1-9-12(10,11)7-4-2-6(8)3-5-7/h2-5,9H,8H2,1H3
charge 0 multiplicity 1
22 atoms
S  1.930605 -0.399726 0.283819
O  2.396945 0.44322 1.593407
O  2.28763 -1.96392 0.020135
N  2.718072 0.482566 -1.138881
N  -4.105641 0.167417 -0.125762
C  0.064158 -0.216641 0.15225
C  -0.561581 0.859992 0.80853
C  -0.658099 -1.182178 -0.574899
C  -2.725229 0.039375 -0.031475
C  -1.958231 0.988791 0.712095
C  -2.054273 -1.051781 -0.666797
C  2.490894 1.940601 -1.173551
H  0.033112 1.560058 1.404696
H  -0.136991 -2.032399 -1.027926
H  2.483332 -0.043908 -1.996302
H  -2.464326 1.817278 1.220986
H  -2.635088 -1.79863 -1.220383
H  2.755685 2.352022 -0.185054
H  1.455968 2.251098 -1.435623
H  3.19156 2.368676 -1.912364
H  -4.592785 0.927822 0.339947
H  -4.660116 -0.514534 -0.635548
