program: Orca
programVersion: 4.2.1
elementType: O O O O O O N N C C C C C C C C C C C C C C C C C C H H H H H H H H H H H H H H H H H H H H H H H H
charge: 0
multiplicity: 1
keywords: wb97x-d3
keywords: def2-TZVPP
keywords: def2/J RIJCOSX GRIDX6 NOFINALGRIDX
keywords: grid4 nofinalgrid
keywords: scfconv7
keywords: smallprint printgap noloewdin
keywords: NOSOSCF
formula: C18H24N2O6
InChI: InChI=1/C18H24N2O6/c1-4-6-7-8-10-13(3)15-11-14(19(22)23)12-16(20(24)25)18(15)26-17(21)9-5-2/h5,9,11-13H,4,6-8,10H2,1-3H3
50 atoms
O  -0.461183 0.902859 0.428794
O  2.1885 3.802006 -0.459954
O  0.490134 3.392711 0.779509
O  5.738238 0.577177 -0.087748
O  5.246001 -1.498516 0.097186
O  -0.569092 1.775204 -1.634982
N  1.463084 3.060647 0.149358
N  4.955361 -0.329764 0.038197
C  0.209624 -1.788109 0.478238
C  -0.291836 -2.144131 -0.933903
C  -1.593051 -2.941734 -0.964325
C  -2.796461 -2.157312 -0.454182
C  1.253935 -0.700281 0.376405
C  -4.116046 -2.902488 -0.597694
C  0.704174 -3.022334 1.22579
C  -5.306434 -2.10008 -0.086895
C  0.863241 0.641151 0.313931
C  2.605279 -0.99602 0.296775
C  1.822039 1.643631 0.161728
C  3.537409 0.013601 0.132198
C  3.164802 1.338408 0.052454
C  -6.632483 -2.827027 -0.253031
C  -1.115669 1.5135 -0.605153
C  -2.527013 1.759091 -0.308097
C  -3.125526 1.475317 0.848223
C  -4.562615 1.726858 1.12985
H  -0.625865 -1.381805 1.051386
H  0.498615 -2.703204 -1.444942
H  -0.432033 -1.232471 -1.521948
H  -1.488669 -3.873433 -0.399811
H  -1.780768 -3.244651 -1.998506
H  -2.859247 -1.206887 -0.994867
H  -2.655631 -1.890021 0.598681
H  -4.277002 -3.15938 -1.650121
H  -4.062647 -3.855684 -0.060642
H  1.131665 -2.762578 2.194573
H  -0.122087 -3.708044 1.410361
H  1.455079 -3.578708 0.662057
H  -5.151062 -1.859342 0.970109
H  -5.344413 -1.140436 -0.612322
H  2.937693 -2.022102 0.353386
H  3.896869 2.120939 -0.082669
H  -6.636976 -3.772319 0.291866
H  -7.467034 -2.23096 0.116505
H  -6.829767 -3.0535 -1.301898
H  -3.076919 2.211286 -1.124326
H  -2.551225 1.030269 1.653196
H  -4.674272 2.379144 1.997909
H  -5.076687 2.18523 0.287037
H  -5.07102 0.791919 1.37519
totalener: -1261.15702816 hartree
nucrepener: 2449.05075034 hartree
electener: -3710.20777850 hartree
oneelecener: -6584.87739864 hartree
twoeener: 2874.66962014 hartree
kineticenergy: 1256.03442775 hartree
xcener: -118.902157350804 hartree
chargesum: -0.0000000
charge: -0.281721 -0.314251 -0.321523 -0.327537 -0.334354 -0.307540 0.503776 0.511592 0.091850 -0.184020 -0.157398 -0.084993 0.003782 -0.125034 -0.304403 -0.080601 0.140257 -0.079928 0.065352 -0.103085 -0.041542 -0.264770 0.374891 -0.245096 -0.036068 -0.199716 0.059695 0.098326 0.097476 0.068029 0.079892 0.060286 0.049996 0.059072 0.057931 0.116165 0.098026 0.081966 0.048594 0.053611 0.154659 0.166831 0.076585 0.085053 0.076847 0.113685 0.117416 0.107373 0.086648 0.087916
qa: -0.2817 -0.3143 -0.3215 -0.3275 -0.3344 -0.3075 0.5038 0.5116 0.0919 -0.1840 -0.1574 -0.0850 0.0038 -0.1250 -0.3044 -0.0806 0.1403 -0.0799 0.0654 -0.1031 -0.0415 -0.2648 0.3749 -0.2451 -0.0361 -0.1997 0.0597 0.0983 0.0975 0.0680 0.0799 0.0603 0.0500 0.0591 0.0579 0.1162 0.0980 0.0820 0.0486 0.0536 0.1547 0.1668 0.0766 0.0851 0.0768 0.1137 0.1174 0.1074 0.0866 0.0879
va: 2.0815 1.9359 1.9095 1.9291 1.9226 2.1781 4.1388 4.1738 3.7242 3.8596 3.9068 3.8506 3.7311 3.9181 3.9444 3.8787 4.1108 4.0572 3.9471 4.1436 4.1356 3.9732 4.2285 3.9376 3.8191 3.9438 1.0210 1.0123 1.0246 1.0089 1.0133 1.0127 1.0082 1.0118 1.0100 1.0014 1.0001 1.0051 1.0020 1.0023 1.0250 1.0381 1.0023 1.0057 1.0028 1.0213 1.0199 1.0014 1.0092 1.0011
dispcorr: -0.026976778 hartree
energy: -1261.184004938372
dipole: -57.32035 54.71560 -2.60475 -34.05055 32.55952 -1.49103 1.64052 -0.72934 0.91118
magnitude: 3.13658 au
magnitude: 7.97255 debye
