program: Orca
programVersion: 4.2.1
elementType: O O O O O O N N C C C C C C C C C C C C C C C C C C H H H H H H H H H H H H H H H H H H H H H H H H
charge: 0
multiplicity: 1
keywords: wb97x-d3
keywords: def2-TZVPP
keywords: def2/J RIJCOSX GRIDX6 NOFINALGRIDX
keywords: grid4 nofinalgrid
keywords: scfconv7
keywords: smallprint printgap noloewdin
keywords: NOSOSCF
formula: C18H24N2O6
InChI: InChI=1/C18H24N2O6/c1-4-6-7-8-10-13(3)15-11-14(19(22)23)12-16(20(24)25)18(15)26-17(21)9-5-2/h5,9,11-13H,4,6-8,10H2,1-3H3
50 atoms
O  -0.864718 1.428138 0.643697
O  0.162431 3.583697 -0.571044
O  2.263919 3.806998 -0.226129
O  4.890229 -0.093095 -1.199906
O  4.11403 -2.025407 -0.700519
O  0.022731 2.559079 2.367383
N  1.259497 3.151172 -0.31987
N  4.021289 -0.827717 -0.804254
C  -0.588161 -1.37296 0.942513
C  -0.920797 -2.516932 -0.021173
C  -1.426831 -2.047277 -1.379522
C  -1.693215 -3.180198 -2.366334
C  0.502099 -0.473108 0.403532
C  -2.800539 -4.140448 -1.948034
C  -0.190289 -1.90113 2.322044
C  -3.099465 -5.195991 -3.005655
C  0.339232 0.908484 0.301501
C  1.719342 -1.023103 0.026245
C  1.395147 1.704002 -0.156029
C  2.749504 -0.218276 -0.419118
C  2.609585 1.151946 -0.506903
C  -4.193639 -6.165551 -2.583842
C  -0.929434 2.305723 1.691298
C  -2.293003 2.820351 1.833435
C  -2.591322 3.676635 2.809516
C  -3.932877 4.272701 3.032963
H  -1.497889 -0.782535 1.062805
H  -1.676346 -3.141178 0.463273
H  -0.047953 -3.166129 -0.155374
H  -0.69766 -1.364015 -1.82425
H  -2.341013 -1.460312 -1.239901
H  -0.767289 -3.74234 -2.529667
H  -1.951581 -2.744325 -3.336024
H  -2.533174 -4.643342 -1.013161
H  -3.712995 -3.572079 -1.734651
H  0.6934 -2.539245 2.267445
H  0.030845 -1.087832 3.013303
H  -0.998742 -2.494892 2.749993
H  -3.387169 -4.702295 -3.93871
H  -2.184016 -5.75163 -3.230232
H  1.868154 -2.091919 0.090583
H  3.421665 1.778422 -0.845185
H  -5.130422 -5.642964 -2.383353
H  -4.391225 -6.908237 -3.356972
H  -3.918216 -6.703285 -1.675085
H  -3.036956 2.496883 1.11604
H  -1.803212 3.973962 3.494314
H  -4.293306 4.041048 4.037197
H  -3.879289 5.361337 2.968226
H  -4.669487 3.92214 2.312148
totalener: -1261.15880324 hartree
nucrepener: 2383.11584018 hartree
electener: -3644.27464342 hartree
oneelecener: -6453.35814279 hartree
twoeener: 2809.08349937 hartree
kineticenergy: 1256.03937648 hartree
xcener: -118.899891785686 hartree
chargesum: 0.0000000
charge: -0.285346 -0.321091 -0.315099 -0.327685 -0.333473 -0.327008 0.502747 0.511489 0.041815 -0.189566 -0.108204 -0.140794 -0.029825 -0.103271 -0.265876 -0.089518 0.194083 -0.063730 0.065859 -0.109672 -0.042328 -0.256023 0.377847 -0.239831 -0.013393 -0.198117 0.060161 0.083956 0.074331 0.082352 0.069680 0.064091 0.073680 0.053990 0.055452 0.084977 0.106328 0.090804 0.055166 0.054777 0.148530 0.166691 0.072788 0.087323 0.071780 0.105055 0.129106 0.094446 0.099689 0.080852
qa: -0.2853 -0.3211 -0.3151 -0.3277 -0.3335 -0.3270 0.5027 0.5115 0.0418 -0.1896 -0.1082 -0.1408 -0.0298 -0.1033 -0.2659 -0.0895 0.1941 -0.0637 0.0659 -0.1097 -0.0423 -0.2560 0.3778 -0.2398 -0.0134 -0.1981 0.0602 0.0840 0.0743 0.0824 0.0697 0.0641 0.0737 0.0540 0.0555 0.0850 0.1063 0.0908 0.0552 0.0548 0.1485 0.1667 0.0728 0.0873 0.0718 0.1051 0.1291 0.0944 0.0997 0.0809
va: 2.0997 1.9089 1.9350 1.9285 1.9251 2.1741 4.1437 4.1746 3.8234 3.8819 3.8586 3.9058 3.6659 3.8607 3.9378 3.8989 4.0460 4.0317 3.9318 4.1438 4.1359 3.9500 4.1916 3.9501 3.8492 3.9522 1.0283 1.0114 1.0117 1.0145 1.0128 1.0104 1.0122 1.0102 1.0100 1.0031 1.0090 1.0061 1.0086 1.0073 1.0277 1.0384 1.0027 1.0062 1.0037 1.0266 1.0185 0.9993 0.9982 1.0105
dispcorr: -0.023416548 hartree
energy: -1261.182219790957
dipole: -44.55026 41.90020 -2.65006 -38.43925 37.74941 -0.68984 -3.29209 4.01889 0.72681
magnitude: 2.83319 au
magnitude: 7.20139 debye
