program: Orca
programVersion: 4.2.1
elementType: O O O O O O N N C C C C C C C C C C C C C C C C C C H H H H H H H H H H H H H H H H H H H H H H H H
charge: 0
multiplicity: 1
keywords: wb97x-d3
keywords: def2-TZVPP
keywords: def2/J RIJCOSX GRIDX6 NOFINALGRIDX
keywords: grid4 nofinalgrid
keywords: scfconv7
keywords: smallprint printgap noloewdin
keywords: NOSOSCF
formula: C18H24N2O6
InChI: InChI=1/C18H24N2O6/c1-4-6-7-8-10-13(3)15-11-14(19(22)23)12-16(20(24)25)18(15)26-17(21)9-5-2/h5,9,11-13H,4,6-8,10H2,1-3H3
50 atoms
O  -0.904132 1.216222 0.847384
O  -0.23419 3.277775 -0.734993
O  1.862453 3.709363 -0.674502
O  4.166018 -1.981593 -0.76278
O  4.694943 -0.069119 -1.567897
O  0.073472 2.634899 2.286209
N  0.919754 2.968763 -0.57188
N  3.9531 -0.815022 -0.980809
C  -0.34287 -1.508862 1.392448
C  -0.746163 -2.717606 0.541028
C  -1.464327 -2.353885 -0.751072
C  -1.874002 -3.574911 -1.565072
C  0.592434 -0.588794 0.639142
C  -2.598965 -3.208798 -2.854559
C  0.290926 -1.940295 2.715631
C  -2.933592 -4.400159 -3.747651
C  0.29251 0.754035 0.41053
C  1.798908 -1.085032 0.164796
C  1.2077 1.567743 -0.266216
C  2.689133 -0.262672 -0.497069
C  2.41516 1.0728 -0.712681
C  -3.911128 -5.388461 -3.125943
C  -0.924865 2.218053 1.779019
C  -2.303943 2.638078 2.035844
C  -2.560475 3.602627 2.918385
C  -3.91491 4.120562 3.238001
H  -1.256846 -0.961045 1.62659
H  -1.395086 -3.354875 1.149818
H  0.134844 -3.329016 0.315382
H  -0.824446 -1.712634 -1.365669
H  -2.350981 -1.755084 -0.516532
H  -2.505384 -4.222203 -0.948708
H  -0.982498 -4.164658 -1.806287
H  -3.519876 -2.667616 -2.611508
H  -1.979658 -2.50602 -3.420509
H  -0.405764 -2.55385 3.287838
H  1.194021 -2.532098 2.557042
H  0.561412 -1.08009 3.327831
H  -3.351725 -4.027863 -4.686355
H  -2.009269 -4.920018 -4.017641
H  2.050631 -2.124623 0.322156
H  3.118624 1.714805 -1.221983
H  -4.840511 -4.894425 -2.836193
H  -4.167518 -6.182674 -3.827267
H  -3.5013 -5.865668 -2.235275
H  -3.095977 2.15628 1.476036
H  -1.725848 4.057722 3.442547
H  -3.976876 5.185845 3.006695
H  -4.698951 3.604307 2.686919
H  -4.120974 4.02468 4.305717
totalener: -1261.15902610 hartree
nucrepener: 2393.04435031 hartree
electener: -3654.20337642 hartree
oneelecener: -6473.24377389 hartree
twoeener: 2819.04039748 hartree
kineticenergy: 1256.04188729 hartree
xcener: -118.900522087904 hartree
chargesum: 0.0000000
charge: -0.287249 -0.321045 -0.314601 -0.333456 -0.327761 -0.325872 0.502499 0.511747 0.049150 -0.172899 -0.101149 -0.126656 -0.032660 -0.106270 -0.271189 -0.114811 0.192129 -0.049772 0.073948 -0.114929 -0.048940 -0.260117 0.376675 -0.239057 -0.012669 -0.199173 0.055638 0.078550 0.071138 0.064366 0.066213 0.061031 0.061955 0.059537 0.067353 0.091480 0.084280 0.107439 0.070059 0.054853 0.145759 0.165994 0.075956 0.088487 0.074265 0.105404 0.128733 0.099533 0.081552 0.094551
qa: -0.2872 -0.3210 -0.3146 -0.3335 -0.3278 -0.3259 0.5025 0.5117 0.0491 -0.1729 -0.1011 -0.1267 -0.0327 -0.1063 -0.2712 -0.1148 0.1921 -0.0498 0.0739 -0.1149 -0.0489 -0.2601 0.3767 -0.2391 -0.0127 -0.1992 0.0556 0.0785 0.0711 0.0644 0.0662 0.0610 0.0620 0.0595 0.0674 0.0915 0.0843 0.1074 0.0701 0.0549 0.1458 0.1660 0.0760 0.0885 0.0743 0.1054 0.1287 0.0995 0.0816 0.0946
va: 2.0965 1.9089 1.9349 1.9252 1.9282 2.1773 4.1433 4.1740 3.8168 3.8846 3.8529 3.8776 3.6632 3.8833 3.9427 3.9024 4.0423 4.0193 3.9198 4.1462 4.1402 3.9300 4.1953 3.9495 3.8480 3.9520 1.0311 1.0153 1.0137 1.0156 1.0136 1.0096 1.0088 1.0104 1.0139 1.0055 1.0033 1.0076 1.0082 1.0093 1.0286 1.0384 1.0023 1.0067 1.0011 1.0261 1.0186 0.9984 1.0101 0.9993
dispcorr: -0.023397416 hartree
energy: -1261.182423520575
dipole: -41.22628 38.75386 -2.47242 -35.58524 34.81846 -0.76679 -1.53272 2.63814 1.10542
magnitude: 2.81475 au
magnitude: 7.15452 debye
