program: Orca
programVersion: 4.2.1
elementType: O O O O O O N N C C C C C C C C C C C C C C C C C C H H H H H H H H H H H H H H H H H H H H H H H H
charge: 0
multiplicity: 1
keywords: wb97x-d3
keywords: def2-TZVPP
keywords: def2/J RIJCOSX GRIDX6 NOFINALGRIDX
keywords: grid4 nofinalgrid
keywords: scfconv7
keywords: smallprint printgap noloewdin
keywords: NOSOSCF
formula: C18H24N2O6
InChI: InChI=1/C18H24N2O6/c1-4-6-7-8-10-13(3)15-11-14(19(22)23)12-16(20(24)25)18(15)26-17(21)9-5-2/h5,9,11-13H,4,6-8,10H2,1-3H3
50 atoms
O  -0.48106 0.699439 1.31644
O  1.409603 3.536922 -0.795273
O  0.413158 3.23745 1.077424
O  5.047703 0.468681 -1.549244
O  4.81034 -1.5841 -0.987681
O  -1.346613 1.414765 -0.627672
N  1.053682 2.855658 0.129945
N  4.441185 -0.437336 -1.036803
C  0.448319 -1.978798 1.464236
C  0.045674 -3.073423 0.467177
C  -1.015865 -2.668547 -0.551458
C  -2.398288 -2.450622 0.060612
C  1.201968 -0.855962 0.783266
C  -3.532768 -2.403153 -0.958883
C  1.286169 -2.558122 2.606205
C  -3.423948 -1.28204 -1.985181
C  0.722044 0.453149 0.741029
C  2.433459 -1.122248 0.198498
C  1.478819 1.456669 0.127196
C  3.153543 -0.120574 -0.421552
C  2.68864 1.178363 -0.472178
C  -4.632433 -1.221089 -2.908074
C  -1.489274 1.197926 0.539459
C  -2.704705 1.370724 1.337444
C  -3.828221 1.802844 0.765774
C  -5.11708 2.005782 1.474031
H  -0.459755 -1.572347 1.910235
H  -0.322934 -3.931934 1.038048
H  0.938551 -3.430693 -0.055873
H  -1.086577 -3.463552 -1.300359
H  -0.69349 -1.775755 -1.095867
H  -2.414269 -1.530306 0.65266
H  -2.602467 -3.261735 0.767654
H  -3.587343 -3.365412 -1.48024
H  -4.481157 -2.301957 -0.421342
H  1.589821 -1.785099 3.311899
H  0.709777 -3.303557 3.154761
H  2.189482 -3.050626 2.242621
H  -3.306103 -0.32494 -1.470528
H  -2.518537 -1.407809 -2.584136
H  2.830769 -2.127773 0.218474
H  3.25436 1.959115 -0.958884
H  -5.552207 -1.046483 -2.346488
H  -4.536463 -0.419785 -3.64078
H  -4.760223 -2.155171 -3.45793
H  -2.658642 1.137921 2.394124
H  -3.813034 2.029575 -0.295829
H  -5.441522 3.044166 1.383294
H  -5.901225 1.397203 1.019303
H  -5.055458 1.755627 2.531528
totalener: -1261.15729722 hartree
nucrepener: 2493.54082292 hartree
electener: -3754.69812013 hartree
oneelecener: -6674.18301498 hartree
twoeener: 2919.48489485 hartree
kineticenergy: 1256.03294247 hartree
xcener: -118.901342739076 hartree
chargesum: -0.0000000
charge: -0.270748 -0.314389 -0.321162 -0.327549 -0.333093 -0.327737 0.503287 0.509934 0.052325 -0.197216 -0.125296 -0.114798 -0.011125 -0.143195 -0.280378 -0.055394 0.168545 -0.030493 0.060619 -0.134065 -0.050771 -0.269494 0.369264 -0.256733 -0.001222 -0.199609 0.071416 0.079106 0.093465 0.085121 0.074425 0.042195 0.079708 0.062957 0.063900 0.105693 0.092529 0.086307 0.030095 0.067815 0.145724 0.166159 0.067270 0.090245 0.076271 0.110483 0.132547 0.100283 0.095088 0.081692
qa: -0.2707 -0.3144 -0.3212 -0.3275 -0.3331 -0.3277 0.5033 0.5099 0.0523 -0.1972 -0.1253 -0.1148 -0.0111 -0.1432 -0.2804 -0.0554 0.1685 -0.0305 0.0606 -0.1341 -0.0508 -0.2695 0.3693 -0.2567 -0.0012 -0.1996 0.0714 0.0791 0.0935 0.0851 0.0744 0.0422 0.0797 0.0630 0.0639 0.1057 0.0925 0.0863 0.0301 0.0678 0.1457 0.1662 0.0673 0.0902 0.0763 0.1105 0.1325 0.1003 0.0951 0.0817
va: 2.1116 1.9360 1.9103 1.9283 1.9261 2.1539 4.1447 4.1762 3.7740 3.9329 3.8585 3.8767 3.6584 3.9011 3.9383 3.8585 4.0488 4.0261 3.9265 4.1634 4.1442 3.9630 4.1671 3.9300 3.8232 3.9572 1.0223 1.0111 1.0111 1.0075 1.0144 1.0128 1.0135 1.0111 1.0108 1.0043 1.0054 1.0035 1.0256 1.0114 1.0288 1.0369 1.0033 1.0043 1.0040 1.0260 1.0140 0.9987 0.9996 1.0106
dispcorr: -0.027421051 hartree
energy: -1261.184718269953
dipole: -45.18668 43.02067 -2.16601 -27.37010 26.15394 -1.21616 1.20709 0.17665 1.38374
magnitude: 2.84348 au
magnitude: 7.22756 debye
