program: Orca
programVersion: 4.2.1
elementType: O O O O O O N N C C C C C C C C C C C C C C C C C C H H H H H H H H H H H H H H H H H H H H H H H H
charge: 0
multiplicity: 1
keywords: wb97x-d3
keywords: def2-TZVPP
keywords: def2/J RIJCOSX GRIDX6 NOFINALGRIDX
keywords: grid4 nofinalgrid
keywords: scfconv7
keywords: smallprint printgap noloewdin
keywords: NOSOSCF
formula: C18H24N2O6
InChI: InChI=1/C18H24N2O6/c1-4-6-7-8-10-13(3)15-11-14(19(22)23)12-16(20(24)25)18(15)26-17(21)9-5-2/h5,9,11-13H,4,6-8,10H2,1-3H3
50 atoms
O  -0.931126 1.147631 1.472871
O  0.106272 3.498341 0.697984
O  0.899183 3.419528 -1.290191
O  4.089486 -0.114639 -1.995032
O  3.694447 -2.045775 -1.15819
O  -2.087434 1.567822 -0.402872
N  0.595935 2.918749 -0.239252
N  3.456559 -0.872284 -1.305288
C  -0.34896 -1.612954 1.78275
C  -0.933945 -2.732837 0.912743
C  -1.927013 -2.239072 -0.137768
C  -2.122895 -3.204905 -1.304436
C  0.4683 -0.664743 0.93076
C  -0.898275 -3.371262 -2.204623
C  0.489125 -2.170954 2.932509
C  -0.426718 -2.085824 -2.876013
C  0.131175 0.679593 0.773942
C  1.580952 -1.146933 0.254033
C  0.887929 1.49542 -0.073939
C  2.30836 -0.325993 -0.584716
C  1.969023 0.998768 -0.771596
C  0.781872 -2.306278 -3.774067
C  -2.013038 1.629388 0.78832
C  -3.03566 2.182461 1.675916
C  -2.887616 2.360309 2.988275
C  -3.922318 2.955496 3.873626
H  -1.182784 -1.061421 2.22023
H  -1.425509 -3.460652 1.565049
H  -0.111984 -3.279714 0.441319
H  -1.615915 -1.268897 -0.531877
H  -2.890451 -2.057002 0.346398
H  -2.960755 -2.852155 -1.912725
H  -2.422318 -4.185293 -0.920549
H  -0.06664 -3.804468 -1.63883
H  -1.133973 -4.108961 -2.977758
H  1.320536 -2.779437 2.572822
H  0.90319 -1.374155 3.550246
H  -0.123498 -2.80616 3.572875
H  -1.248402 -1.655747 -3.45657
H  -0.174161 -1.335322 -2.121917
H  1.870055 -2.182779 0.36495
H  2.532977 1.63425 -1.438445
H  0.559872 -3.011878 -4.576251
H  1.110955 -1.375975 -4.237592
H  1.62484 -2.710899 -3.210698
H  -3.945869 2.481009 1.170625
H  -1.957816 2.071667 3.465758
H  -4.185971 2.263251 4.675594
H  -3.536744 3.855507 4.356386
H  -4.829936 3.218455 3.333543
totalener: -1261.15516515 hartree
nucrepener: 2533.12191077 hartree
electener: -3794.27707593 hartree
oneelecener: -6753.41751702 hartree
twoeener: 2959.14044110 hartree
kineticenergy: 1256.03514392 hartree
xcener: -118.903478613169 hartree
chargesum: -0.0000000
charge: -0.284010 -0.321818 -0.314257 -0.327295 -0.339296 -0.313035 0.507958 0.541403 0.061029 -0.192980 -0.125610 -0.154415 0.061092 -0.132314 -0.273273 -0.077244 0.149085 -0.104745 0.079062 -0.155695 -0.035819 -0.273037 0.380721 -0.237600 -0.033507 -0.193610 0.054043 0.087901 0.078177 0.071801 0.083281 0.077484 0.070729 0.058014 0.077402 0.085736 0.103129 0.092060 0.075498 0.029570 0.144086 0.164463 0.082613 0.094522 0.071114 0.113835 0.118159 0.092669 0.099163 0.083762
qa: -0.2840 -0.3218 -0.3143 -0.3273 -0.3393 -0.3130 0.5080 0.5414 0.0610 -0.1930 -0.1256 -0.1544 0.0611 -0.1323 -0.2733 -0.0772 0.1491 -0.1047 0.0791 -0.1557 -0.0358 -0.2730 0.3807 -0.2376 -0.0335 -0.1936 0.0540 0.0879 0.0782 0.0718 0.0833 0.0775 0.0707 0.0580 0.0774 0.0857 0.1031 0.0921 0.0755 0.0296 0.1441 0.1645 0.0826 0.0945 0.0711 0.1138 0.1182 0.0927 0.0992 0.0838
va: 2.0755 1.9084 1.9383 1.9276 1.9112 2.1734 4.1371 4.1454 3.8195 3.8692 3.8591 3.9535 3.5823 3.8729 3.9404 3.8562 4.0999 4.0063 3.9176 4.1058 4.1247 3.9400 4.2240 3.9918 3.8534 3.9501 1.0270 1.0145 1.0102 1.0137 1.0104 1.0084 1.0085 1.0096 1.0122 1.0033 1.0049 1.0056 1.0111 1.0095 1.0292 1.0397 1.0071 1.0044 1.0087 1.0202 1.0212 0.9998 0.9982 1.0099
dispcorr: -0.028804190 hartree
energy: -1261.183969342273
dipole: -22.68449 21.06266 -1.62183 -28.03261 27.29234 -0.74027 4.12440 -1.85808 2.26632
magnitude: 2.88349 au
magnitude: 7.32926 debye
