program: Orca
programVersion: 4.2.1
elementType: O O O O O O N N C C C C C C C C C C C C C C C C C C H H H H H H H H H H H H H H H H H H H H H H H H
charge: 0
multiplicity: 1
keywords: wb97x-d3
keywords: def2-TZVPP
keywords: def2/J RIJCOSX GRIDX6 NOFINALGRIDX
keywords: grid4 nofinalgrid
keywords: scfconv7
keywords: smallprint printgap noloewdin
keywords: NOSOSCF
formula: C18H24N2O6
InChI: InChI=1/C18H24N2O6/c1-4-6-7-8-10-13(3)15-11-14(19(22)23)12-16(20(24)25)18(15)26-17(21)9-5-2/h5,9,11-13H,4,6-8,10H2,1-3H3
50 atoms
O  -0.856502 1.568713 -1.027896
O  0.396272 3.516365 0.348449
O  1.345562 2.750004 2.109003
O  3.796261 -2.423686 -0.091932
O  4.419398 -0.8601 1.232193
O  -1.750479 1.426318 1.027882
N  0.928302 2.642012 0.985854
N  3.664481 -1.342717 0.427102
C  -0.408137 -0.927065 -2.350749
C  -1.801025 -1.290614 -1.810243
C  -1.802514 -2.002251 -0.460646
C  -1.128101 -3.371609 -0.463465
C  0.508485 -0.32872 -1.30291
C  -0.937015 -3.951291 0.936436
C  -0.497904 -0.083473 -3.622709
C  0.176276 -3.272465 1.728653
C  0.252167 0.883864 -0.658109
C  1.651189 -1.027832 -0.942757
C  1.126634 1.352365 0.325954
C  2.493079 -0.557205 0.048128
C  2.243053 0.630919 0.699808
C  0.331041 -3.837712 3.132645
C  -1.819306 1.834849 -0.0933
C  -2.891277 2.632733 -0.691178
C  -3.95455 2.981597 0.032096
C  -5.088562 3.798976 -0.468152
H  0.070965 -1.866515 -2.641516
H  -2.281499 -1.926243 -2.561198
H  -2.423541 -0.395114 -1.749494
H  -2.839623 -2.127893 -0.13688
H  -1.344375 -1.356623 0.292956
H  -0.148052 -3.324942 -0.949753
H  -1.725633 -4.057077 -1.072051
H  -1.878537 -3.883806 1.4925
H  -0.71048 -5.018688 0.85847
H  -1.053567 -0.629974 -4.385863
H  -1.008837 0.863167 -3.458562
H  0.491154 0.131788 -4.027213
H  1.119336 -3.385111 1.183977
H  -0.008742 -2.196502 1.793178
H  1.872322 -1.966546 -1.430866
H  2.897865 0.994297 1.478084
H  0.550348 -4.906348 3.108206
H  1.141427 -3.348551 3.673005
H  -0.5813 -3.702764 3.715793
H  -2.78404 2.936137 -1.725289
H  -4.004507 2.655293 1.066225
H  -5.194005 4.706584 0.129356
H  -4.967082 4.086432 -1.510883
H  -6.028485 3.252858 -0.366848
totalener: -1261.15562698 hartree
nucrepener: 2525.36873897 hartree
electener: -3786.52436595 hartree
oneelecener: -6737.99601138 hartree
twoeener: 2951.47164543 hartree
kineticenergy: 1256.03740327 hartree
xcener: -118.902773786173 hartree
chargesum: -0.0000000
charge: -0.274978 -0.321543 -0.315053 -0.335801 -0.328057 -0.325200 0.507733 0.533642 0.039936 -0.204441 -0.125372 -0.120553 0.066914 -0.136665 -0.284361 -0.072478 0.130567 -0.119946 0.071484 -0.085385 -0.047167 -0.262526 0.354401 -0.243380 -0.006578 -0.199477 0.057354 0.090624 0.077846 0.082055 0.079102 0.059335 0.083007 0.058629 0.072710 0.094281 0.092184 0.100262 0.044571 0.050115 0.145091 0.163733 0.075430 0.088350 0.075324 0.108063 0.129216 0.100017 0.082106 0.094878
qa: -0.2750 -0.3215 -0.3151 -0.3358 -0.3281 -0.3252 0.5077 0.5336 0.0399 -0.2044 -0.1254 -0.1206 0.0669 -0.1367 -0.2844 -0.0725 0.1306 -0.1199 0.0715 -0.0854 -0.0472 -0.2625 0.3544 -0.2434 -0.0066 -0.1995 0.0574 0.0906 0.0778 0.0821 0.0791 0.0593 0.0830 0.0586 0.0727 0.0943 0.0922 0.1003 0.0446 0.0501 0.1451 0.1637 0.0754 0.0884 0.0753 0.1081 0.1292 0.1000 0.0821 0.0949
va: 2.1005 1.9095 1.9367 1.9141 1.9279 2.1660 4.1375 4.1538 3.7981 3.9013 3.8799 3.8517 3.5819 3.9351 3.9375 3.8728 4.1035 4.0141 3.9265 4.0365 4.1447 3.9664 4.2050 3.9530 3.8468 3.9534 1.0123 1.0105 1.0108 1.0134 1.0152 1.0154 1.0117 1.0090 1.0087 1.0033 1.0090 1.0044 1.0093 1.0085 1.0245 1.0408 1.0029 1.0051 1.0030 1.0239 1.0190 0.9984 1.0106 0.9993
dispcorr: -0.028473692 hartree
energy: -1261.184100675318
dipole: -29.55312 27.32487 -2.22826 -23.52097 23.54299 0.02202 -6.62249 4.96531 -1.65718
magnitude: 2.77702 au
magnitude: 7.05863 debye
