program: Gaussian 09
title: 000074360
version: EM64L-G09RevD.01
frameworkgroup: C1[X(C9H18O2)]
method: RPBEPBE
basis: SDD
operation: Freq
keyword: #pfreq=noraman
keyword: PBEPBE/SDD
title: #p freq=noraman PBEPBE/SDD
converged: YES YES NO NO
title: Mulliken charges:
elementType: O O C C C C C C C C C H H H H H H H H H H H H H H H H H H
charge: -0.270027 -0.278730 -0.396088 -0.372592 0.000481 -0.366627 -0.353983 -0.315208 -0.303483 -0.355368 -0.696078 0.217352 0.213218 0.223128 0.185162 0.208376 0.193315 0.186725 0.187490 0.191162 0.208598 0.233506 0.210530 0.224736 0.194397 0.195302 0.214797 0.209693 0.210214
chargesum: 0.00000
title: Mulliken charges with hydrogens summed into heavy atoms:
elementType: O O C C C C C C C C C
charge: -0.270027 -0.278730 0.034482 0.035698 0.208857 0.013414 0.024669 0.126897 0.131783 0.034331 -0.061373
polarizability: 1.33072739e+02 1.86524421e+00 8.95783541e+01 3.00258702e+00 4.68568444e-01 8.69145645e+01
1716.lowfreq: -15.7363 -5.4462 -0.0003 0.0007 0.0007 7.2924 25.6937 35.4740 47.5567
frequency: 24.8612 35.4391 47.0667 69.9988 90.6825 115.1293 142.4257 171.2236 225.4494 228.1787 252.4555 315.2275 407.5176 446.5403 502.3101 611.7262 661.5991 721.1915 726.8889 753.3563 808.9593 857.1650 881.5424 888.0369 892.9236 927.2874 971.0792 983.4093 996.5110 1023.4201 1034.4308 1070.2245 1081.6603 1093.2558 1109.5537 1118.4803 1148.0217 1160.2040 1192.7634 1195.7570 1223.9596 1240.1455 1260.0162 1277.5590 1281.9548 1286.8308 1292.6401 1316.9905 1325.7053 1331.4434 1350.2889 1356.8187 1371.7525 1388.7726 1447.9649 1462.2172 1464.5068 1467.7237 1473.4297 1476.6287 1476.6651 1482.1186 1488.0516 2950.7828 2954.7730 2961.4939 2965.5984 2968.5426 2971.4455 2981.8676 2987.0598 2988.7088 2991.7926 3003.7691 3023.3741 3036.4343 3060.0166 3068.1213 3070.0562 3086.3891 3104.0585
redmass: 2.5026 3.3202 2.2813 3.6712 2.7556 1.7773 2.1921 2.8191 1.9273 1.6358 2.3321 3.3370 2.9106 3.5481 2.7812 2.3832 5.9612 1.1297 1.3828 1.5111 1.4272 2.2914 2.9179 1.7701 1.8633 2.5335 2.3166 1.5998 2.9493 3.2266 3.2647 2.8643 2.1279 2.0075 1.8080 2.1261 2.1977 1.1825 1.4830 1.3557 1.2646 1.3219 1.2152 1.1474 1.1684 1.1530 1.0956 1.3247 1.2397 1.3028 1.4838 1.6216 1.5837 1.2173 1.0876 1.0663 1.0762 1.0930 1.0729 1.0821 1.0543 1.0810 1.0893 1.0589 1.0594 1.0756 1.0692 1.0621 1.0366 1.0695 1.0836 1.0729 1.0620 1.0990 1.1007 1.1030 1.1032 1.1007 1.0992 1.1005 1.1012
irintensity: 6.4688 0.3630 3.7385 1.9940 1.1818 0.3879 0.1839 1.4697 0.6158 0.3738 2.1156 3.8749 3.3365 4.6299 10.1771 4.0139 4.5904 6.9944 12.2124 9.9396 22.4449 2.5019 25.3298 6.5202 3.5996 25.7318 9.7307 10.8783 19.3151 32.3751 14.9617 15.0790 1.0326 61.5716 39.9046 8.0731 21.2875 0.8586 6.0419 7.6719 5.1227 0.6943 4.5103 0.4586 2.0965 3.1360 1.4806 3.0257 3.5075 0.4207 2.8715 3.5930 32.8138 10.4542 5.9084 0.0836 0.5169 5.6197 1.8107 8.3433 5.8278 2.5495 24.6019 1.0879 10.0689 19.0041 20.1992 145.5389 38.4309 63.6889 6.8104 19.1101 79.1519 3.9458 10.0438 46.9166 70.7852 106.2216 55.0836 33.7888 31.7658
temp: 298.150 k
press: 1.00000 atm
elementType: 8 8 6 6 6 6 6 6 6 6 6 1 1 1 1 1 1 1 1 1 1 1 1 1 1 1 1 1 1
symmnumber: 1
zpe: 674110.2 jmol-1
zpe.correction: 0.256755 hartree
zpe.thermalcorrener: 0.269946 hartree
zpe.thermalcorrenthalpy: 0.270890 hartree
zpe.thermalcorrgfe: 0.214650 hartree
zpe.sumelectzpe: -503.259425 hartree
zpe.sumelectthermal: -503.246234 hartree
zpe.sumelectthermalent: -503.245290 hartree
zpe.sumelectthermalfe: -503.301529 hartree
dipole: 1.0663 0.3753 0.3697
dipole: 1.1893
quadrupole: -58.8891 -73.5470 -67.6994
quadrupole: 5.0349 1.8010 2.0885
quadrupole: 7.8227 -6.8351 -0.9876 5.0349 1.8010 2.0885
hfenergy: -503.5161797 hartree
pointgroup: C01 [X(C9H18O2)]
dipole: 0.4170412 -0.1437992 -0.156023 debye
polarizability: 132.9819618|-2.0049454|89.5561244|-3.5417495|0.6237161|87.0275719 unknown
InChI: InChI=1S/C9H18O2/c1-2-3-4-5-6-9-10-7-8-11-9/h9H,2-8H2,1H3
charge 0 multiplicity 1
29 atoms
O  3.096152 1.057779 0.021991
O  2.28003 -1.173246 0.134844
C  0.679083 0.731573 -0.150168
C  -0.571509 0.002742 0.387907
C  1.968237 0.240945 0.500155
C  -1.873564 0.477092 -0.29448
C  -3.138521 -0.215724 0.260164
C  4.236263 0.127701 -0.13053
C  3.548377 -1.154951 -0.630854
C  -4.44126 0.245059 -0.432722
C  -5.702381 -0.440586 0.136183
H  0.769967 0.594933 -1.24445
H  0.596032 1.820196 0.040557
H  -0.446533 -1.087765 0.239281
H  -0.652566 0.16568 1.483272
H  1.918132 0.261523 1.609712
H  -1.802914 0.29151 -1.386652
H  -1.975385 1.576169 -0.172123
H  -3.216084 -0.020226 1.350368
H  -3.034461 -1.31537 0.149004
H  4.739157 -0.036133 0.84383
H  4.932772 0.584118 -0.850643
H  3.342082 -1.104741 -1.717775
H  4.094024 -2.081575 -0.389344
H  -4.538801 1.345304 -0.329682
H  -4.366737 0.040739 -1.520489
H  -6.618689 -0.09689 -0.378417
H  -5.81891 -0.223518 1.214906
H  -5.641892 -1.539438 0.021054
