program: Orca
programVersion: 4.2.1
elementType: O O O O O O N N C C C C C C C C C C C C C C C C C C H H H H H H H H H H H H H H H H H H H H H H H H
charge: 0
multiplicity: 1
keywords: wb97x-d3
keywords: def2-TZVPP
keywords: def2/J RIJCOSX GRIDX6 NOFINALGRIDX
keywords: grid4 nofinalgrid
keywords: scfconv7
keywords: smallprint printgap noloewdin
keywords: NOSOSCF
formula: C18H24N2O6
InChI: InChI=1/C18H24N2O6/c1-4-6-7-8-10-13(3)15-11-14(19(22)23)12-16(20(24)25)18(15)26-17(21)9-5-2/h5,9,11-13H,4,6-8,10H2,1-3H3
50 atoms
O  -0.923391 1.295672 0.965484
O  -0.27361 3.378703 -0.589773
O  1.836273 3.736356 -0.662256
O  3.951734 -2.015114 -0.979551
O  4.498138 -0.10154 -1.770223
O  0.177583 2.632988 2.39284
N  0.876719 3.026291 -0.510865
N  3.763775 -0.838241 -1.162481
C  -0.418051 -1.441615 1.439798
C  -0.751033 -2.747124 0.712661
C  -1.43051 -2.550902 -0.636029
C  -1.779465 -3.864801 -1.323046
C  0.498388 -0.549325 0.631785
C  -2.443524 -3.66917 -2.679819
C  0.207039 -1.70763 2.810935
C  -2.776746 -4.977399 -3.385155
C  0.231198 0.807873 0.450478
C  1.663173 -1.070508 0.086415
C  1.134273 1.609304 -0.255818
C  2.543506 -0.259612 -0.603021
C  2.300667 1.087758 -0.776123
C  -3.428554 -4.766722 -4.744054
C  -0.859877 2.269134 1.924631
C  -2.207884 2.728966 2.264598
C  -2.384367 3.678311 3.182402
C  -3.701368 4.234072 3.584354
H  -1.360721 -0.915535 1.598714
H  -1.404865 -3.332664 1.366279
H  0.151365 -3.355889 0.589206
H  -0.785481 -1.963419 -1.296933
H  -2.339973 -1.955934 -0.500098
H  -2.43774 -4.454084 -0.67562
H  -0.869117 -4.46103 -1.447815
H  -3.358879 -3.080375 -2.555805
H  -1.787601 -3.070139 -3.320761
H  -0.466611 -2.301194 3.430012
H  1.144936 -2.2585 2.719699
H  0.420163 -0.779413 3.341406
H  -1.862661 -5.566501 -3.505348
H  -3.437415 -5.574801 -2.74966
H  1.890804 -2.120179 0.209227
H  2.996702 1.719495 -1.307946
H  -2.775885 -4.202547 -5.412199
H  -3.656542 -5.714739 -5.231386
H  -4.362939 -4.2103 -4.653836
H  -3.044298 2.290022 1.735086
H  -1.508431 4.091466 3.672673
H  -3.738314 5.305902 3.380016
H  -4.530422 3.757469 3.064457
H  -3.854366 4.119734 4.659022
totalener: -1261.16019704 hartree
nucrepener: 2384.59414318 hartree
electener: -3645.75434022 hartree
oneelecener: -6456.34528868 hartree
twoeener: 2810.59094846 hartree
kineticenergy: 1256.04375484 hartree
xcener: -118.900167691229 hartree
chargesum: -0.0000000
charge: -0.282353 -0.321325 -0.315289 -0.333801 -0.327874 -0.327280 0.502925 0.512476 0.029257 -0.171742 -0.093225 -0.113172 0.001195 -0.105281 -0.266360 -0.082922 0.184324 -0.096099 0.062396 -0.091754 -0.046687 -0.259744 0.379978 -0.240528 -0.012589 -0.198388 0.059306 0.079402 0.068933 0.065181 0.067262 0.057288 0.059682 0.053598 0.055049 0.090598 0.086624 0.103913 0.053812 0.052648 0.152786 0.166102 0.073876 0.086324 0.072645 0.104870 0.128863 0.099747 0.081022 0.094331
qa: -0.2824 -0.3213 -0.3153 -0.3338 -0.3279 -0.3273 0.5029 0.5125 0.0293 -0.1717 -0.0932 -0.1132 0.0012 -0.1053 -0.2664 -0.0829 0.1843 -0.0961 0.0624 -0.0918 -0.0467 -0.2597 0.3800 -0.2405 -0.0126 -0.1984 0.0593 0.0794 0.0689 0.0652 0.0673 0.0573 0.0597 0.0536 0.0550 0.0906 0.0866 0.1039 0.0538 0.0526 0.1528 0.1661 0.0739 0.0863 0.0726 0.1049 0.1289 0.0997 0.0810 0.0943
va: 2.1056 1.9086 1.9351 1.9242 1.9282 2.1726 4.1432 4.1725 3.8327 3.8755 3.8417 3.8876 3.6550 3.8844 3.9388 3.8903 4.0654 4.0329 3.9427 4.1279 4.1380 3.9545 4.1881 3.9505 3.8493 3.9524 1.0285 1.0142 1.0149 1.0131 1.0137 1.0128 1.0118 1.0107 1.0112 1.0056 1.0030 1.0106 1.0078 1.0075 1.0262 1.0386 1.0032 1.0058 1.0028 1.0265 1.0185 0.9983 1.0103 0.9992
dispcorr: -0.023155253 hartree
energy: -1261.183352294734
dipole: -38.81380 36.39354 -2.42027 -35.58360 34.84336 -0.74024 -2.45856 3.71465 1.25609
magnitude: 2.82549 au
magnitude: 7.18183 debye
