program: Orca
programVersion: 4.2.1
elementType: O O O O O O N N C C C C C C C C C C C C C C C C C C H H H H H H H H H H H H H H H H H H H H H H H H
charge: 0
multiplicity: 1
keywords: wb97x-d3
keywords: def2-TZVPP
keywords: def2/J RIJCOSX GRIDX6 NOFINALGRIDX
keywords: grid4 nofinalgrid
keywords: scfconv7
keywords: smallprint printgap noloewdin
keywords: NOSOSCF
formula: C18H24N2O6
InChI: InChI=1/C18H24N2O6/c1-4-6-7-8-10-13(3)15-11-14(19(22)23)12-16(20(24)25)18(15)26-17(21)9-5-2/h5,9,11-13H,4,6-8,10H2,1-3H3
50 atoms
O  -0.881337 1.104859 0.918425
O  -0.397096 3.120119 -0.788283
O  1.672129 3.670042 -0.833989
O  4.281758 -1.890202 -0.782969
O  4.671011 0.009798 -1.690662
O  0.076612 2.647996 2.237567
N  0.778246 2.883811 -0.659778
N  3.996243 -0.747408 -1.040517
C  -0.150679 -1.560395 1.549878
C  -0.595252 -2.774358 0.726688
C  -1.426584 -2.421597 -0.499282
C  -1.883531 -3.649142 -1.276615
C  0.703678 -0.624361 0.723881
C  -2.712004 -3.304439 -2.507093
C  0.587582 -1.983138 2.820273
C  -3.149327 -4.528386 -3.301554
C  0.319438 0.687954 0.448662
C  1.912559 -1.078203 0.214559
C  1.157346 1.516507 -0.305475
C  2.726165 -0.241272 -0.523549
C  2.36992 1.066445 -0.784435
C  -3.973257 -4.173288 -4.530513
C  -0.917856 2.149127 1.802076
C  -2.305811 2.500327 2.109222
C  -2.577035 3.491994 2.956584
C  -3.943046 3.944353 3.322824
H  -1.053389 -1.029664 1.855833
H  -1.175858 -3.431168 1.38202
H  0.279583 -3.360552 0.423496
H  -0.851004 -1.771557 -1.165869
H  -2.299095 -1.836296 -0.18997
H  -2.464362 -4.304433 -0.61856
H  -1.006826 -4.231021 -1.58113
H  -3.596101 -2.733725 -2.202666
H  -2.13583 -2.637802 -3.157816
H  -0.058218 -2.601736 3.444262
H  1.481575 -2.568292 2.59788
H  0.894549 -1.11923 3.409534
H  -2.265148 -5.096997 -3.605134
H  -3.726381 -5.194712 -2.653225
H  2.22704 -2.095004 0.404981
H  3.014158 1.720926 -1.352822
H  -3.409983 -3.535913 -5.213967
H  -4.273079 -5.06345 -5.083621
H  -4.881903 -3.634939 -4.256226
H  -3.093322 1.944475 1.615664
H  -1.746924 4.021408 3.413753
H  -4.080301 4.992856 3.051178
H  -4.720382 3.35924 2.83478
H  -4.090589 3.88416 4.402798
totalener: -1261.16032750 hartree
nucrepener: 2391.55896012 hartree
electener: -3652.71928762 hartree
oneelecener: -6470.27505180 hartree
twoeener: 2817.55576418 hartree
kineticenergy: 1256.04445506 hartree
xcener: -118.900031032157 hartree
chargesum: 0.0000000
charge: -0.287665 -0.320946 -0.314348 -0.333459 -0.327747 -0.325278 0.502881 0.511711 0.058196 -0.178702 -0.091085 -0.117330 -0.031163 -0.103718 -0.275081 -0.083899 0.182304 -0.043137 0.081156 -0.119802 -0.049802 -0.259042 0.375981 -0.239414 -0.013012 -0.198791 0.054452 0.078428 0.071635 0.063072 0.065260 0.057265 0.059335 0.053209 0.055166 0.091593 0.083712 0.108811 0.053933 0.052534 0.144979 0.165002 0.073763 0.086243 0.072807 0.105596 0.128832 0.099443 0.081454 0.094670
qa: -0.2877 -0.3209 -0.3143 -0.3335 -0.3277 -0.3253 0.5029 0.5117 0.0582 -0.1787 -0.0911 -0.1173 -0.0312 -0.1037 -0.2751 -0.0839 0.1823 -0.0431 0.0812 -0.1198 -0.0498 -0.2590 0.3760 -0.2394 -0.0130 -0.1988 0.0545 0.0784 0.0716 0.0631 0.0653 0.0573 0.0593 0.0532 0.0552 0.0916 0.0837 0.1088 0.0539 0.0525 0.1450 0.1650 0.0738 0.0862 0.0728 0.1056 0.1288 0.0994 0.0815 0.0947
va: 2.0957 1.9089 1.9350 1.9253 1.9283 2.1790 4.1427 4.1741 3.8122 3.8955 3.8403 3.8858 3.6651 3.8833 3.9440 3.8896 4.0472 4.0199 3.9071 4.1496 4.1427 3.9544 4.1984 3.9498 3.8485 3.9521 1.0315 1.0147 1.0127 1.0150 1.0147 1.0125 1.0111 1.0109 1.0115 1.0053 1.0035 1.0066 1.0077 1.0075 1.0289 1.0387 1.0033 1.0057 1.0028 1.0258 1.0187 0.9986 1.0102 0.9991
dispcorr: -0.023141557 hartree
energy: -1261.183469059993
dipole: -40.69081 38.30881 -2.38200 -33.93793 33.08264 -0.85529 -1.77365 3.05719 1.28354
magnitude: 2.83777 au
magnitude: 7.21303 debye
