program: Gaussian 09
title: 000074361
version: EM64L-G09RevD.01
frameworkgroup: C1[X(C10H20O3)]
method: RPBEPBE
basis: SDD
operation: Freq
keyword: #pfreq=noraman
keyword: PBEPBE/SDD
title: #p freq=noraman PBEPBE/SDD
converged: YES YES NO NO
title: Mulliken charges:
elementType: O O O C C C C C C C C C C H H H H H H H H H H H H H H H H H H H H
charge: -0.247588 -0.241393 -0.434113 -0.434712 0.007249 -0.374417 -0.364945 -0.073844 -0.355433 -0.355388 -0.360065 -0.355582 -0.696054 0.224238 0.215716 0.189791 0.227868 0.180581 0.194673 0.187118 0.222520 0.186653 0.191566 0.256211 0.184874 0.184048 0.257321 0.194606 0.196120 0.215584 0.209226 0.210472 0.357098
chargesum: 0.00000
title: Mulliken charges with hydrogens summed into heavy atoms:
elementType: O O O C C C C C C C C C C
charge: -0.247588 -0.241393 -0.077015 0.005242 0.197040 0.034031 0.016846 0.148677 0.022786 0.085698 0.081304 0.035144 -0.060772
polarizability: 1.48954214e+02 6.61589808e-01 1.03482528e+02 -2.20266031e+00 -1.62439273e+00 1.00114816e+02
1716.lowfreq: -13.5370 -6.8477 -1.6057 -0.0012 -0.0010 -0.0009 28.2996 36.1640 49.4390
frequency: 28.2508 35.9336 49.3767 74.6574 106.8627 117.2921 138.7557 155.6429 175.3236 213.0546 231.1533 243.8009 294.8251 368.5874 375.2497 410.3235 426.2317 443.1514 499.8567 546.8393 547.5291 721.3700 729.4827 758.1023 787.5824 794.4375 819.7563 872.6388 888.8324 890.6229 901.2330 926.9305 944.0360 985.0156 998.1462 1017.2321 1037.0074 1067.7188 1076.5711 1081.7961 1090.7163 1105.0013 1121.3839 1164.6804 1191.8516 1197.6512 1208.9237 1230.0682 1246.1100 1276.5527 1278.4848 1282.6110 1285.5308 1291.0437 1293.9459 1313.5551 1323.7061 1348.3586 1352.6895 1356.4679 1363.6515 1369.4295 1384.8700 1388.6049 1439.4836 1450.4156 1451.6718 1462.7363 1465.0173 1474.1463 1476.8785 1482.8862 1488.3555 2884.1524 2946.2465 2951.0636 2954.9581 2956.3726 2963.9516 2968.4375 2971.6533 2988.5197 3000.3244 3005.4557 3026.6267 3040.2012 3051.1673 3067.9081 3069.4714 3070.5370 3104.5769 3107.4840 3532.8933
redmass: 3.8916 1.7008 4.0219 3.3269 1.9561 2.7775 2.3126 3.4185 3.7249 4.0051 1.1216 3.8147 3.1395 2.0253 1.6212 1.8355 2.7474 2.9312 5.2080 5.8643 2.7172 1.0786 1.2654 1.5483 4.3693 2.9050 1.7091 2.8455 1.9907 1.9336 1.8461 2.9244 3.0496 1.2932 3.4356 3.6824 3.1778 2.7074 1.9443 2.0779 1.6921 2.4983 2.4521 1.8840 1.3473 1.1443 1.3333 1.2966 1.3392 1.3095 1.1642 1.6312 1.1563 1.2994 1.1142 1.1741 1.3352 1.3710 1.4007 1.5740 1.3166 1.2284 1.6339 1.2200 1.0835 1.0994 1.0859 1.0653 1.0761 1.0719 1.0432 1.0805 1.0909 1.0832 1.0682 1.0589 1.0595 1.0681 1.0634 1.0603 1.0365 1.0963 1.0617 1.0974 1.1008 1.1017 1.0864 1.1013 1.1023 1.0992 1.0948 1.0968 1.0650
irintensity: 0.5104 0.2123 0.5504 0.4847 0.1722 0.2636 0.3522 1.6416 11.3642 0.5627 0.1516 11.9601 0.6887 4.6999 23.8037 49.3025 2.2467 40.6348 7.4090 7.0195 1.7423 8.9737 8.3653 11.3192 10.9265 25.3334 37.8932 1.4495 18.2400 34.1768 6.7182 24.3813 27.3059 6.9054 57.9070 53.5447 18.3483 17.4441 12.2069 3.9398 39.6302 75.2407 3.6380 18.3287 7.5490 14.8746 24.2809 13.1496 2.4763 1.6856 0.4136 0.3299 2.3628 2.7989 2.6488 4.0935 4.1004 0.7021 3.5783 6.5047 5.3819 50.9069 22.9858 9.8436 12.2803 11.0928 7.9629 0.1336 0.3320 1.8229 12.2929 1.6687 25.1710 62.4951 17.9508 0.8661 12.9460 100.2984 9.7301 128.4729 37.1760 2.3718 22.5738 5.8052 21.0289 45.3241 44.5624 18.3325 134.0389 55.0016 18.9554 17.4146 7.2624
temp: 298.150 k
press: 1.00000 atm
elementType: 8 8 8 6 6 6 6 6 6 6 6 6 6 1 1 1 1 1 1 1 1 1 1 1 1 1 1 1 1 1 1 1 1
symmnumber: 1
zpe: 760231.0 jmol-1
zpe.correction: 0.289557 hartree
zpe.thermalcorrener: 0.304641 hartree
zpe.thermalcorrenthalpy: 0.305585 hartree
zpe.thermalcorrgfe: 0.245799 hartree
zpe.sumelectzpe: -617.626543 hartree
zpe.sumelectthermal: -617.611458 hartree
zpe.sumelectthermalent: -617.610514 hartree
zpe.sumelectthermalfe: -617.670301 hartree
dipole: -0.5961 -0.0218 -2.7745
dipole: 2.8379
quadrupole: -84.5226 -83.5134 -79.4261
quadrupole: 0.8314 -11.9187 -0.9247
quadrupole: -2.0352 -1.0260 3.0613 0.8314 -11.9187 -0.9247
hfenergy: -617.9160994 hartree
pointgroup: C01 [X(C10H20O3)]
dipole: -0.2398618 0.0664174 1.0884263 debye
polarizability: 148.918622|-0.8721794|103.3172712|2.4804415|-1.80974|100.3156648 unknown
InChI: InChI=1S/C10H20O3/c1-2-3-4-5-6-10-12-7-9(11)8-13-10/h9-11H,2-8H2,1H3
charge 0 multiplicity 1
33 atoms
O  1.543026 -1.006479 0.024546
O  2.33455 1.272349 -0.065912
O  4.216359 -0.717027 -1.266296
C  -0.041902 0.819628 -0.209253
C  1.272588 0.38234 0.420345
C  -1.259212 0.034409 0.32679
C  -2.585431 0.48695 -0.323532
C  3.972289 -0.570512 0.171219
C  -3.815426 -0.284893 0.20461
C  2.810893 -1.480053 0.626629
C  3.639451 0.89468 0.527394
C  -5.144468 0.168798 -0.441584
C  -6.369476 -0.606507 0.089694
H  0.046702 0.691489 -1.304555
H  -0.162934 1.90196 -0.013702
H  1.254857 0.430012 1.538153
H  -1.100179 -1.045723 0.145936
H  -1.330568 0.164909 1.427349
H  -2.516587 0.357194 -1.423788
H  -2.731683 1.573562 -0.147294
H  4.915676 -0.879337 0.655852
H  -3.883966 -0.159568 1.305749
H  -3.672946 -1.370909 0.024136
H  2.948349 -2.506483 0.254675
H  2.723872 -1.484977 1.735601
H  3.605056 1.033658 1.630511
H  4.375182 1.581986 0.08354
H  -5.285228 1.254195 -0.260601
H  -5.075252 0.044225 -1.541627
H  -7.30556 -0.262894 -0.387946
H  -6.479402 -0.473732 1.18272
H  -6.268024 -1.690653 -0.106914
H  3.379693 -0.445995 -1.728247
