program: Orca
programVersion: 4.2.1
elementType: O O O O O O N N C C C C C C C C C C C C C C C C C C H H H H H H H H H H H H H H H H H H H H H H H H
charge: 0
multiplicity: 1
keywords: wb97x-d3
keywords: def2-TZVPP
keywords: def2/J RIJCOSX GRIDX6 NOFINALGRIDX
keywords: grid4 nofinalgrid
keywords: scfconv7
keywords: smallprint printgap noloewdin
keywords: NOSOSCF
formula: C18H24N2O6
InChI: InChI=1/C18H24N2O6/c1-4-6-7-8-10-13(3)15-11-14(19(22)23)12-16(20(24)25)18(15)26-17(21)9-5-2/h5,9,11-13H,4,6-8,10H2,1-3H3
50 atoms
O  -0.936523 0.651073 0.250273
O  1.62739 3.642295 -0.551503
O  -0.286429 2.865883 -1.118298
O  4.844078 -1.574137 -0.127157
O  5.207979 0.438305 -0.762246
O  -0.593086 2.14331 1.89134
N  0.832689 2.748949 -0.685071
N  4.489412 -0.449712 -0.379584
C  -0.056454 -1.949506 0.919911
C  0.076972 -3.261206 0.138441
C  -0.133546 -3.142707 -1.369529
C  -1.453751 -2.502459 -1.792259
C  0.856025 -0.866398 0.39053
C  -2.690453 -3.244262 -1.297455
C  0.212205 -2.167222 2.410364
C  -4.006519 -2.648534 -1.789961
C  0.390738 0.417708 0.106176
C  2.206965 -1.131385 0.214636
C  1.281831 1.403506 -0.329523
C  3.070701 -0.140721 -0.21022
C  2.627618 1.138836 -0.477373
C  -4.296625 -1.258531 -1.23802
C  -1.354998 1.581269 1.162474
C  -2.810171 1.728343 1.095146
C  -3.439416 2.588239 1.894817
C  -4.905471 2.824396 1.894418
H  -1.088803 -1.611651 0.82083
H  -0.644343 -3.966744 0.560167
H  1.056472 -3.712461 0.327552
H  -0.066072 -4.145248 -1.802172
H  0.690717 -2.575347 -1.811102
H  -1.482101 -2.460483 -2.885447
H  -1.482309 -1.460953 -1.461517
H  -2.627418 -4.289081 -1.618224
H  -2.705535 -3.268689 -0.202167
H  1.230085 -2.520167 2.585471
H  0.078818 -1.247322 2.979942
H  -0.470962 -2.914694 2.815649
H  -4.003889 -2.615037 -2.883506
H  -4.823937 -3.31858 -1.511914
H  2.590476 -2.12048 0.422863
H  3.308531 1.912629 -0.80017
H  -5.272192 -0.899142 -1.566204
H  -4.299519 -1.265717 -0.145498
H  -3.556458 -0.52623 -1.562667
H  -3.348955 1.130893 0.369825
H  -2.849211 3.169586 2.59641
H  -5.324207 2.639991 2.885743
H  -5.121225 3.868269 1.65767
H  -5.42715 2.194421 1.175963
totalener: -1261.15705183 hartree
nucrepener: 2487.14913706 hartree
electener: -3748.30618889 hartree
oneelecener: -6661.30096515 hartree
twoeener: 2912.99477626 hartree
kineticenergy: 1256.03698522 hartree
xcener: -118.903596495323 hartree
chargesum: 0.0000000
charge: -0.284810 -0.314570 -0.322162 -0.333294 -0.327772 -0.325067 0.508164 0.512661 0.041531 -0.204356 -0.137216 -0.112906 0.065345 -0.141144 -0.264916 -0.101292 0.165157 -0.129881 0.039269 -0.082209 -0.038873 -0.270868 0.379267 -0.241499 -0.014046 -0.198872 0.046199 0.090930 0.086793 0.081980 0.084215 0.081747 0.050632 0.077738 0.058534 0.087695 0.103664 0.091766 0.056036 0.070421 0.152734 0.165733 0.095271 0.071172 0.078316 0.099701 0.128465 0.094263 0.098843 0.081512
qa: -0.2848 -0.3146 -0.3222 -0.3333 -0.3278 -0.3251 0.5082 0.5127 0.0415 -0.2044 -0.1372 -0.1129 0.0653 -0.1411 -0.2649 -0.1013 0.1652 -0.1299 0.0393 -0.0822 -0.0389 -0.2709 0.3793 -0.2415 -0.0140 -0.1989 0.0462 0.0909 0.0868 0.0820 0.0842 0.0817 0.0506 0.0777 0.0585 0.0877 0.1037 0.0918 0.0560 0.0704 0.1527 0.1657 0.0953 0.0712 0.0783 0.0997 0.1285 0.0943 0.0988 0.0815
va: 2.0896 1.9358 1.9065 1.9246 1.9292 2.1769 4.1381 4.1741 3.7982 3.8652 3.9122 3.8543 3.6265 3.8768 3.9328 3.9164 4.1090 4.0417 3.9558 4.1242 4.1289 3.9306 4.2019 3.9425 3.8564 3.9518 1.0277 1.0025 1.0153 1.0092 1.0078 1.0137 1.0149 1.0132 1.0071 1.0042 1.0100 1.0052 1.0109 1.0072 1.0283 1.0398 1.0083 0.9980 0.9974 1.0288 1.0180 0.9994 0.9989 1.0099
dispcorr: -0.027059878 hartree
energy: -1261.184111705312
dipole: -43.45523 40.91631 -2.53892 -28.32043 27.06243 -1.25800 0.87370 -0.37940 0.49430
magnitude: 2.87629 au
magnitude: 7.31094 debye
