program: Gaussian 09
title: 000074480
version: EM64L-G09RevD.01
frameworkgroup: C1[X(C18H27N3O)]
method: RPBEPBE
basis: SDD
operation: Freq
keyword: #p
keyword: freq=noraman
keyword: PBEPBE/SDD
title: #p freq=noraman PBEPBE/SDD
converged: NO YES NO NO
title: Mulliken charges:
elementType: O N N N C C C C C C C C C C C C C C C C C C H H H H H H H H H H H H H H H H H H H H H H H H H H H
charge: -0.258885 -0.198794 -0.089207 -0.608421 0.324063 -0.491957 -0.498660 -0.407230 -0.399149 -0.374211 -0.373116 -0.400826 -0.409226 0.126107 -0.400507 -0.481820 0.454693 -0.448535 -0.381853 -0.222247 -0.231319 -0.247650 0.206060 0.217060 0.211986 0.218872 0.254089 0.217381 0.202264 0.218164 0.178319 0.222722 0.239541 0.193848 0.195857 0.197794 0.194356 0.199354 0.193121 0.216157 0.217109 0.198983 0.318059 0.343547 0.232503 0.262617 0.222697 0.221386 0.224909
chargesum: 0.00000
title: Mulliken charges with hydrogens summed into heavy atoms:
elementType: O N N N C C C C C C C C C C C C C C C C C C
charge: -0.258885 -0.198794 -0.089207 0.053185 0.324063 -0.068837 -0.067803 0.064239 0.021279 0.026830 0.060273 -0.007176 -0.015517 0.126107 0.008770 -0.065728 0.454693 -0.216033 -0.119236 0.000450 -0.009933 -0.022741
polarizability: 2.62022946e+02 1.03692356e+00 2.06714343e+02 2.08821149e+01 -2.63320810e+00 1.61332830e+02
1716.lowfreq: -12.3656 -4.9540 -0.0010 -0.0005 -0.0001 8.1806 20.6555 28.0222 39.3778
frequency: 20.2916 27.9736 38.7880 56.6218 80.0759 88.3982 99.8059 134.2266 178.5477 182.9993 209.8204 216.2307 229.8565 250.9836 270.8961 299.2155 307.8868 325.8773 340.0614 371.8594 374.3090 391.8698 405.6066 429.5276 444.5576 465.2378 478.1711 490.0671 514.8174 563.4616 570.9363 599.0329 616.6572 650.8786 662.9678 704.7125 717.9881 732.3263 738.1974 775.3473 803.9296 806.9982 813.8980 815.7851 852.8281 858.7189 863.2585 893.3858 912.5714 925.3442 940.2690 956.9016 966.5387 981.4001 989.6403 994.0014 1003.0378 1009.0162 1024.0734 1026.2132 1040.6660 1054.0511 1059.7648 1074.3932 1077.6960 1083.6105 1115.0055 1119.0244 1128.1145 1140.4821 1147.3668 1156.6580 1165.3791 1168.4527 1178.7233 1191.1893 1210.0972 1212.0466 1242.0470 1258.3566 1260.4077 1271.6538 1280.2478 1291.0721 1293.2900 1311.4707 1315.9496 1326.3296 1333.9647 1338.8200 1340.9849 1349.7885 1351.4320 1362.9632 1366.2206 1376.2009 1381.6559 1398.0990 1439.6295 1443.3903 1451.4722 1455.4167 1458.3208 1459.4717 1466.0049 1469.2813 1474.4714 1479.1114 1481.3751 1484.3365 1522.4995 1593.9309 1614.3289 1626.8548 2851.0688 2865.2329 2887.4418 2888.3975 2936.7046 2970.1741 2979.3294 2980.8066 2981.4149 2984.4979 2997.9857 3018.6493 3031.8653 3033.4265 3038.6367 3040.8184 3050.3805 3056.2734 3063.7860 3073.4309 3111.4972 3120.1143 3133.7727 3145.0534 3159.5004 3433.2629 3639.0636
redmass: 4.1629 4.2524 3.8309 4.5351 3.6230 3.8499 4.6935 3.9147 3.3779 3.4683 2.7920 4.1078 2.6547 2.6651 2.2309 2.5985 2.1711 2.8214 2.6756 2.8597 2.4811 2.2171 2.8442 2.9086 2.8152 2.9810 2.9867 2.2959 2.7166 2.0421 1.5657 4.2201 6.2638 2.6845 3.1226 2.1794 3.7586 1.1664 1.6325 2.8033 1.9691 2.3949 1.5653 3.6853 1.5692 1.2498 2.1921 2.6078 1.4644 2.3060 1.9741 1.3199 2.4038 1.3825 5.0780 1.4547 2.4682 1.9313 1.7550 1.9247 2.5394 2.1124 2.0040 1.6389 1.5269 2.4960 2.3940 2.8620 3.5551 2.3269 1.3087 2.3785 2.6863 1.0732 1.1124 1.0982 1.7879 1.8135 1.8074 1.2868 1.4310 1.2171 1.5597 1.3497 1.4395 1.5272 1.5197 1.4955 1.3135 1.3757 1.3908 1.4224 1.5562 1.4669 1.4243 1.3375 3.3368 1.7114 2.0723 1.0870 1.0909 1.0986 1.1271 1.0878 1.0921 1.0811 1.0982 1.0949 1.9401 1.1708 1.3029 6.1715 6.1460 6.5736 1.0700 1.0707 1.0697 1.0699 1.0661 1.0621 1.0614 1.0620 1.0863 1.0619 1.0625 1.0857 1.0936 1.0957 1.0908 1.1016 1.1032 1.1002 1.0977 1.0935 1.0865 1.0863 1.0916 1.0953 1.1014 1.0484 1.0995
irintensity: 0.1322 0.5598 0.1131 2.9867 0.3718 1.0738 4.9296 0.3866 1.0118 1.6432 1.3390 0.5192 3.3005 1.4597 3.5804 0.5280 10.5259 7.9038 1.3254 0.1670 11.1050 5.4722 0.5068 0.7831 0.9321 15.0711 0.7160 3.4053 7.7208 55.3722 111.9317 1.3370 0.6418 16.8569 0.2824 29.8727 59.9220 26.5740 54.6424 17.3349 4.5731 2.0619 1.8044 0.4776 3.2372 0.2557 13.4646 2.9840 4.0696 8.3601 2.0242 2.2815 23.5150 0.5588 0.2660 4.0403 39.8855 12.2043 8.7779 7.5403 7.1418 11.2165 13.6750 10.0597 15.8065 48.4236 21.0359 3.4383 2.0925 11.2408 4.9823 7.5233 18.5696 1.7837 2.7617 5.4746 5.8017 4.8357 13.0054 3.5268 24.2018 14.2966 4.9438 7.1096 11.5451 40.8598 5.2953 5.3361 9.4585 8.2147 15.3316 8.8748 8.6928 13.6668 3.2817 2.3185 6.5219 1.6499 12.9684 3.7615 6.3485 3.8998 8.9009 16.4025 13.8203 5.4314 6.7235 1.7312 9.6048 28.9578 151.8397 0.8163 9.5827 249.3011 68.6378 55.8445 39.6445 110.5510 31.6227 35.2831 38.4941 35.5326 26.8532 18.1582 20.9730 56.0530 29.3989 73.6227 36.7087 13.3668 77.5305 25.1144 46.1426 24.6961 7.9297 0.3236 20.8730 34.6712 30.3701 61.7612 66.1101
temp: 298.150 k
press: 1.00000 atm
elementType: 8 7 7 7 6 6 6 6 6 6 6 6 6 6 6 6 6 6 6 6 6 6 1 1 1 1 1 1 1 1 1 1 1 1 1 1 1 1 1 1 1 1 1 1 1 1 1 1 1
symmnumber: 1
zpe: 1116481.0 jmol-1
zpe.correction: 0.425245 hartree
zpe.thermalcorrener: 0.445736 hartree
zpe.thermalcorrenthalpy: 0.446681 hartree
zpe.thermalcorrgfe: 0.375259 hartree
zpe.sumelectzpe: -939.905363 hartree
zpe.sumelectthermal: -939.884871 hartree
zpe.sumelectthermalent: -939.883927 hartree
zpe.sumelectthermalfe: -939.955349 hartree
dipole: 3.1688 -1.5826 1.4243
dipole: 3.8177
quadrupole: -119.1770 -131.8807 -134.2220
quadrupole: 0.0242 4.1078 5.5491
quadrupole: 9.2496 -3.4541 -5.7954 0.0242 4.1078 5.5491
hfenergy: -940.3306078 hartree
pointgroup: C01 [X(C18H27N3O1)]
dipole: -1.2036228 0.6248286 0.6456623 debye
polarizability: 260.8495663|0.6706137|205.8469694|-23.3904069|7.1326322|163.3735832 unknown
InChI: InChI=1S/C18H27N3O/c19-17(22)18(21-11-5-2-6-12-21)9-13-20(14-10-18)15-16-7-3-1-4-8-16/h1,3-4,7-8H,2,5-6,9-15,19H2
charge 0 multiplicity 1
49 atoms
O  -1.342629 -2.617392 -1.223081
N  -2.900429 0.306332 0.237415
N  1.325034 -0.720577 0.588165
N  -3.2745 -2.330761 0.041172
C  -1.624754 -0.505156 0.09894
C  -0.5575 0.165037 -0.821295
C  -0.971231 -0.748162 1.495017
C  0.828207 -0.517684 -0.800522
C  0.35991 -1.516082 1.387282
C  -2.858689 1.505592 1.12016
C  -3.497263 0.658223 -1.088212
C  -4.281012 2.069826 1.340723
C  -4.941464 1.171478 -0.926078
C  -2.057778 -1.908748 -0.450719
C  -4.973819 2.404846 0.002182
C  2.687277 -1.303653 0.608019
C  3.766712 -0.327867 0.145392
C  4.879077 -0.786924 -0.601721
C  3.70058 1.04342 0.500098
C  5.912828 0.101222 -0.979485
C  4.728736 1.934133 0.121069
C  5.841599 1.46612 -0.617956
H  -0.442289 1.214063 -0.482459
H  -0.908242 0.180653 -1.868971
H  -1.678152 -1.280728 2.158138
H  -0.725771 0.227572 1.951239
H  0.759102 -1.486364 -1.343492
H  1.55373 0.12627 -1.330933
H  0.777817 -1.649684 2.403503
H  0.195099 -2.533221 0.955083
H  -2.211506 2.310555 0.688889
H  -2.43564 1.227053 2.09805
H  -3.483047 -0.239415 -1.732505
H  -2.895793 1.445571 -1.603643
H  -4.214611 2.969153 1.983148
H  -4.879939 1.314235 1.886607
H  -5.568417 0.364533 -0.497283
H  -5.354992 1.419335 -1.922605
H  -4.442243 3.246235 -0.488895
H  -6.014218 2.73861 0.175832
H  2.899247 -1.599677 1.656137
H  2.752505 -2.238464 -0.005243
H  -3.63689 -3.246353 -0.220127
H  -3.828799 -1.634347 0.5515
H  4.934891 -1.843767 -0.892769
H  2.82671 1.391864 1.062098
H  6.766564 -0.269317 -1.558641
H  4.665053 2.992312 0.401147
H  6.639938 2.157202 -0.911869
