program: Orca
programVersion: 4.2.1
elementType: O O O O O O N N C C C C C C C C C C C C C C C C C C H H H H H H H H H H H H H H H H H H H H H H H H
charge: 0
multiplicity: 1
keywords: wb97x-d3
keywords: def2-TZVPP
keywords: def2/J RIJCOSX GRIDX6 NOFINALGRIDX
keywords: grid4 nofinalgrid
keywords: scfconv7
keywords: smallprint printgap noloewdin
keywords: NOSOSCF
formula: C18H24N2O6
InChI: InChI=1/C18H24N2O6/c1-4-6-7-8-10-13(3)15-11-14(19(22)23)12-16(20(24)25)18(15)26-17(21)9-5-2/h5,9,11-13H,4,6-8,10H2,1-3H3
50 atoms
O  -0.311111 1.121093 1.654017
O  0.75293 3.507582 1.048367
O  1.575793 3.559977 -0.927954
O  4.712121 0.042791 -1.871452
O  4.321376 -1.928473 -1.131768
O  -1.455366 1.697339 -0.189156
N  1.250552 2.989315 0.080161
N  4.079637 -0.750688 -1.222069
C  0.242309 -1.656548 1.782658
C  -0.375818 -2.720631 0.868557
C  -1.328289 -2.165985 -0.182149
C  -1.898242 -3.253908 -1.083715
C  1.06544 -0.667998 0.986618
C  -2.865178 -2.723318 -2.133507
C  1.082381 -2.291097 2.891117
C  -3.409845 -3.812094 -3.049788
C  0.746701 0.688524 0.925968
C  2.17537 -1.116425 0.283532
C  1.521327 1.553488 0.145557
C  2.923209 -0.24553 -0.484253
C  2.603255 1.094018 -0.575996
C  -4.375392 -3.278567 -4.097764
C  -1.381391 1.670739 1.003267
C  -2.357488 2.168067 1.975082
C  -3.488901 2.738841 1.564119
C  -4.53121 3.295602 2.463474
H  -0.57894 -1.12145 2.261665
H  -0.91125 -3.437134 1.499468
H  0.4178 -3.296839 0.379832
H  -0.81968 -1.418051 -0.798299
H  -2.147782 -1.635306 0.314436
H  -2.404098 -4.00884 -0.471858
H  -1.074206 -3.775902 -1.582191
H  -3.698629 -2.214367 -1.637459
H  -2.364483 -1.95808 -2.735959
H  1.504131 -1.536295 3.554471
H  0.467791 -2.960237 3.494021
H  1.908034 -2.881214 2.490271
H  -2.575445 -4.317339 -3.545514
H  -3.908229 -4.577639 -2.447184
H  2.450469 -2.161383 0.324015
H  3.184137 1.768999 -1.187095
H  -5.240158 -2.801264 -3.633939
H  -3.894763 -2.534941 -4.735324
H  -4.746355 -4.074635 -4.743573
H  -2.119931 2.074351 3.027504
H  -3.670872 2.815326 0.496685
H  -4.279518 3.177169 3.515829
H  -4.676079 4.358866 2.262459
H  -5.493709 2.81367 2.281445
totalener: -1261.16027175 hartree
nucrepener: 2417.37129434 hartree
electener: -3678.53156609 hartree
oneelecener: -6522.00400318 hartree
twoeener: 2843.47243709 hartree
kineticenergy: 1256.04054468 hartree
xcener: -118.899437114970 hartree
chargesum: 0.0000000
charge: -0.273166 -0.321686 -0.315512 -0.327646 -0.333024 -0.324393 0.507195 0.510077 0.064728 -0.179166 -0.081900 -0.133256 -0.018176 -0.099413 -0.273493 -0.081777 0.167996 -0.044982 0.064224 -0.117646 -0.048651 -0.261071 0.377772 -0.248151 -0.012302 -0.197564 0.056946 0.078848 0.070799 0.074170 0.053717 0.056712 0.058369 0.050825 0.060534 0.105575 0.091262 0.085000 0.053318 0.051851 0.145203 0.166297 0.071665 0.075501 0.085123 0.105455 0.129087 0.081142 0.099276 0.094309
qa: -0.2732 -0.3217 -0.3155 -0.3276 -0.3330 -0.3244 0.5072 0.5101 0.0647 -0.1792 -0.0819 -0.1333 -0.0182 -0.0994 -0.2735 -0.0818 0.1680 -0.0450 0.0642 -0.1176 -0.0487 -0.2611 0.3778 -0.2482 -0.0123 -0.1976 0.0569 0.0788 0.0708 0.0742 0.0537 0.0567 0.0584 0.0508 0.0605 0.1056 0.0913 0.0850 0.0533 0.0519 0.1452 0.1663 0.0717 0.0755 0.0851 0.1055 0.1291 0.0811 0.0993 0.0943
va: 2.1128 1.9092 1.9366 1.9282 1.9256 2.1657 4.1413 4.1754 3.8107 3.8884 3.8462 3.9105 3.6353 3.8844 3.9415 3.8832 4.0788 4.0266 3.9388 4.1462 4.1418 3.9548 4.1794 3.9655 3.8485 3.9524 1.0284 1.0145 1.0111 1.0202 1.0158 1.0111 1.0112 1.0116 1.0117 1.0049 1.0055 1.0035 1.0077 1.0071 1.0291 1.0383 1.0029 1.0030 1.0057 1.0269 1.0180 1.0107 0.9984 0.9992
dispcorr: -0.023868405 hartree
energy: -1261.184140153675
dipole: -42.92923 40.90353 -2.02570 -31.27660 30.50133 -0.77527 -1.48900 3.23497 1.74597
magnitude: 2.78440 au
magnitude: 7.07739 debye
