program: Orca
programVersion: 4.2.1
elementType: O O O O O O N N C C C C C C C C C C C C C C C C C C H H H H H H H H H H H H H H H H H H H H H H H H
charge: 0
multiplicity: 1
keywords: wb97x-d3
keywords: def2-TZVPP
keywords: def2/J RIJCOSX GRIDX6 NOFINALGRIDX
keywords: grid4 nofinalgrid
keywords: scfconv7
keywords: smallprint printgap noloewdin
keywords: NOSOSCF
formula: C18H24N2O6
InChI: InChI=1/C18H24N2O6/c1-4-6-7-8-10-13(3)15-11-14(19(22)23)12-16(20(24)25)18(15)26-17(21)9-5-2/h5,9,11-13H,4,6-8,10H2,1-3H3
50 atoms
O  -0.737036 0.878599 1.63815
O  0.735288 3.374021 -1.139429
O  0.148047 3.323436 0.920035
O  4.046907 0.0606 -2.270439
O  3.852937 -1.914523 -1.465873
O  -2.041074 1.439933 -0.10204
N  0.562464 2.811682 -0.090302
N  3.525879 -0.757326 -1.555413
C  0.069078 -1.827888 1.835908
C  -0.340581 -3.149614 1.169688
C  -1.647845 -3.108789 0.380134
C  -1.670472 -2.264172 -0.890215
C  0.70158 -0.828938 0.890793
C  -0.750099 -2.765385 -1.996481
C  1.038255 -2.077671 2.996698
C  -0.90977 -2.003164 -3.309836
C  0.285342 0.502458 0.830113
C  1.785402 -1.212383 0.113197
C  0.931857 1.398521 -0.026629
C  2.404766 -0.312074 -0.730984
C  1.983036 0.998153 -0.824774
C  -0.468352 -0.547355 -3.237256
C  -1.877072 1.386805 1.081398
C  -2.8104 1.80115 2.1303
C  -3.99787 2.312869 1.808638
C  -5.014085 2.779138 2.785414
H  -0.836154 -1.387886 2.258342
H  -0.466357 -3.883285 1.971037
H  0.47266 -3.543851 0.553413
H  -2.44031 -2.761257 1.051138
H  -1.914229 -4.137535 0.11803
H  -1.451846 -1.220074 -0.659785
H  -2.696618 -2.262416 -1.271752
H  0.297104 -2.710992 -1.680815
H  -0.953659 -3.827041 -2.171261
H  1.325754 -1.146403 3.484778
H  0.577074 -2.720474 3.747105
H  1.951298 -2.569977 2.657199
H  -0.333546 -2.512022 -4.086729
H  -1.955414 -2.05441 -3.62897
H  2.145021 -2.230875 0.158921
H  2.460696 1.695672 -1.496937
H  -0.58657 -0.051028 -4.200474
H  -1.037857 0.026676 -2.505993
H  0.585453 -0.472621 -2.963567
H  -2.499224 1.691656 3.161775
H  -4.250818 2.407293 0.757199
H  -5.23394 3.836828 2.627553
H  -5.955347 2.244732 2.642917
H  -4.693859 2.645364 3.817013
totalener: -1261.15480501 hartree
nucrepener: 2551.75694904 hartree
electener: -3812.91175405 hartree
oneelecener: -6790.84405986 hartree
twoeener: 2977.93230581 hartree
kineticenergy: 1256.03797177 hartree
xcener: -118.905157198709 hartree
chargesum: 0.0000000
charge: -0.273867 -0.313883 -0.323082 -0.329330 -0.334038 -0.340078 0.514407 0.543488 0.054186 -0.173066 -0.161288 -0.062281 0.065773 -0.143963 -0.271314 -0.095347 0.143117 -0.147578 0.094814 -0.161344 -0.063653 -0.276478 0.401670 -0.249126 -0.012713 -0.197735 0.053477 0.083090 0.085377 0.069610 0.077661 0.027338 0.079023 0.059577 0.076843 0.103046 0.089184 0.090872 0.070023 0.051688 0.158633 0.161807 0.095891 0.089756 0.078403 0.106109 0.129851 0.099376 0.094674 0.081400
qa: -0.2739 -0.3139 -0.3231 -0.3293 -0.3340 -0.3401 0.5144 0.5435 0.0542 -0.1731 -0.1613 -0.0623 0.0658 -0.1440 -0.2713 -0.0953 0.1431 -0.1476 0.0948 -0.1613 -0.0637 -0.2765 0.4017 -0.2491 -0.0127 -0.1977 0.0535 0.0831 0.0854 0.0696 0.0777 0.0273 0.0790 0.0596 0.0768 0.1030 0.0892 0.0909 0.0700 0.0517 0.1586 0.1618 0.0959 0.0898 0.0784 0.1061 0.1299 0.0994 0.0947 0.0814
va: 2.1111 1.9392 1.9082 1.9268 1.9234 2.1467 4.1376 4.1493 3.7763 3.8675 3.9379 3.8613 3.5437 3.8914 3.9399 3.9085 4.0958 4.0297 3.8479 4.1021 4.0882 3.9500 4.1449 3.9688 3.8477 3.9528 1.0328 1.0102 1.0071 1.0102 1.0097 1.0282 1.0134 1.0086 1.0130 1.0051 1.0069 1.0017 1.0063 1.0100 1.0224 1.0421 1.0104 1.0031 0.9880 1.0259 1.0182 0.9985 0.9991 1.0106
dispcorr: -0.029607011 hartree
energy: -1261.184412018818
dipole: -25.80826 23.95166 -1.85660 -23.97345 23.13284 -0.84062 3.85688 -1.90399 1.95289
magnitude: 2.82266 au
magnitude: 7.17462 debye
