program: Orca
programVersion: 4.2.1
elementType: O O O O O O N N C C C C C C C C C C C C C C C C C C H H H H H H H H H H H H H H H H H H H H H H H H
charge: 0
multiplicity: 1
keywords: wb97x-d3
keywords: def2-TZVPP
keywords: def2/J RIJCOSX GRIDX6 NOFINALGRIDX
keywords: grid4 nofinalgrid
keywords: scfconv7
keywords: smallprint printgap noloewdin
keywords: NOSOSCF
formula: C18H24N2O6
InChI: InChI=1/C18H24N2O6/c1-4-6-7-8-10-13(3)15-11-14(19(22)23)12-16(20(24)25)18(15)26-17(21)9-5-2/h5,9,11-13H,4,6-8,10H2,1-3H3
50 atoms
O  -0.382021 1.133841 1.18124
O  0.92317 3.463519 1.469648
O  2.285017 3.848989 -0.13753
O  5.374101 0.281708 -1.042882
O  4.69374 -1.744778 -0.918973
O  -0.921095 2.246413 -0.692599
N  1.653703 3.114451 0.576276
N  4.545416 -0.555221 -0.789361
C  -0.06375 -1.602701 0.785176
C  -0.952717 -1.724031 -0.463999
C  -2.24407 -2.500202 -0.235047
C  -3.14096 -2.496717 -1.467214
C  1.042909 -0.60952 0.509366
C  -4.503102 -3.151446 -1.250902
C  0.461805 -2.959752 1.244666
C  -4.467004 -4.617983 -0.825798
C  0.821418 0.759866 0.682777
C  2.278637 -1.020159 0.03443
C  1.824172 1.677784 0.365182
C  3.254585 -0.092077 -0.282924
C  3.042663 1.261966 -0.134426
C  -3.75011 -5.528842 -1.812702
C  -1.198642 1.92944 0.425757
C  -2.406216 2.270348 1.180451
C  -3.356169 3.022069 0.626147
C  -4.610315 3.438913 1.30287
H  -0.678077 -1.201834 1.595448
H  -0.372204 -2.195888 -1.26457
H  -1.204076 -0.726364 -0.835034
H  -2.786456 -2.060637 0.610039
H  -2.01512 -3.530062 0.051936
H  -2.617632 -2.980786 -2.297616
H  -3.301448 -1.462271 -1.786004
H  -5.05581 -2.578956 -0.499366
H  -5.08112 -3.066749 -2.176277
H  0.940268 -3.514727 0.435658
H  1.180603 -2.858885 2.058237
H  -0.356336 -3.577978 1.610969
H  -4.005336 -4.712588 0.160959
H  -5.495798 -4.964995 -0.700144
H  2.483397 -2.07225 -0.099893
H  3.805988 1.981556 -0.391402
H  -3.822006 -6.573424 -1.509508
H  -4.180794 -5.446447 -2.812239
H  -2.688908 -5.289733 -1.894229
H  -2.491717 1.905788 2.196478
H  -3.211636 3.367399 -0.39276
H  -4.673508 4.527776 1.347065
H  -5.48109 3.10278 0.736939
H  -4.686255 3.049653 2.316399
totalener: -1261.15767114 hartree
nucrepener: 2398.73566624 hartree
electener: -3659.89333738 hartree
oneelecener: -6484.54776572 hartree
twoeener: 2824.65442834 hartree
kineticenergy: 1256.03559043 hartree
xcener: -118.901595605084 hartree
chargesum: 0.0000000
charge: -0.277265 -0.321681 -0.315276 -0.327869 -0.334173 -0.323758 0.504357 0.511190 0.143203 -0.209437 -0.129949 -0.136269 -0.001797 -0.145334 -0.317958 -0.122435 0.142406 -0.083812 0.060188 -0.107935 -0.040986 -0.255822 0.376547 -0.252948 -0.009792 -0.198776 0.061762 0.089151 0.090937 0.067218 0.064033 0.071588 0.079923 0.066723 0.077292 0.082652 0.117581 0.098998 0.058900 0.073739 0.156615 0.166938 0.089439 0.081033 0.070191 0.105315 0.129744 0.099681 0.094692 0.081235
qa: -0.2773 -0.3217 -0.3153 -0.3279 -0.3342 -0.3238 0.5044 0.5112 0.1432 -0.2094 -0.1299 -0.1363 -0.0018 -0.1453 -0.3180 -0.1224 0.1424 -0.0838 0.0602 -0.1079 -0.0410 -0.2558 0.3765 -0.2529 -0.0098 -0.1988 0.0618 0.0892 0.0909 0.0672 0.0640 0.0716 0.0799 0.0667 0.0773 0.0827 0.1176 0.0990 0.0589 0.0737 0.1566 0.1669 0.0894 0.0810 0.0702 0.1053 0.1297 0.0997 0.0947 0.0812
va: 2.1119 1.9092 1.9359 1.9285 1.9230 2.1645 4.1415 4.1739 3.6938 3.8792 3.8235 3.8874 3.7295 3.8950 3.9405 3.8827 4.0990 4.0594 3.9628 4.1483 4.1332 3.9333 4.1865 3.9595 3.8450 3.9528 1.0261 1.0130 1.0278 1.0118 1.0081 1.0034 1.0141 1.0114 1.0085 1.0021 1.0024 0.9998 1.0027 1.0086 1.0245 1.0384 1.0071 1.0034 1.0004 1.0266 1.0183 0.9982 0.9991 1.0106
dispcorr: -0.024137892 hartree
energy: -1261.181809028659
dipole: -52.52816 49.90493 -2.62323 -38.13085 37.13867 -0.99218 -3.28639 4.23274 0.94634
magnitude: 2.95996 au
magnitude: 7.52361 debye
