program: Orca
programVersion: 4.2.1
elementType: O O O O O O N N C C C C C C C C C C C C C C C C C C H H H H H H H H H H H H H H H H H H H H H H H H
charge: 0
multiplicity: 1
keywords: wb97x-d3
keywords: def2-TZVPP
keywords: def2/J RIJCOSX GRIDX6 NOFINALGRIDX
keywords: grid4 nofinalgrid
keywords: scfconv7
keywords: smallprint printgap noloewdin
keywords: NOSOSCF
formula: C18H24N2O6
InChI: InChI=1/C18H24N2O6/c1-4-6-7-8-10-13(3)15-11-14(19(22)23)12-16(20(24)25)18(15)26-17(21)9-5-2/h5,9,11-13H,4,6-8,10H2,1-3H3
50 atoms
O  -0.771954 1.37237 1.090574
O  -0.015491 3.50174 -0.339521
O  2.110613 3.746008 -0.414464
O  3.875623 -2.093226 -1.120669
O  4.527895 -0.169506 -1.798639
O  0.400092 2.530291 2.612146
N  1.114311 3.08214 -0.296381
N  3.758543 -0.897731 -1.225066
C  -0.425667 -1.421816 1.383116
C  -1.111176 -2.391196 0.4131
C  -1.911334 -1.699141 -0.683837
C  -2.673394 -2.661118 -1.590784
C  0.548469 -0.524839 0.652267
C  -1.773238 -3.580064 -2.41176
C  0.2680 -2.167911 2.522693
C  -2.514777 -4.386025 -3.47426
C  0.354227 0.85249 0.546649
C  1.669265 -1.080514 0.051173
C  1.294062 1.640761 -0.12559
C  2.585507 -0.282886 -0.606153
C  2.421739 1.084768 -0.693244
C  -3.530221 -5.368927 -2.907009
C  -0.655403 2.268988 2.117836
C  -1.947559 2.818369 2.528278
C  -3.098144 2.616712 1.887081
C  -4.397279 3.212607 2.294873
H  -1.204787 -0.800502 1.827147
H  -1.77847 -3.036768 0.993636
H  -0.360922 -3.057556 -0.024663
H  -1.246568 -1.082618 -1.297587
H  -2.621231 -1.007016 -0.219739
H  -3.29687 -2.076268 -2.274631
H  -3.366078 -3.253868 -0.985153
H  -1.002376 -2.974349 -2.899542
H  -1.240228 -4.272008 -1.751979
H  0.753669 -1.478923 3.213436
H  -0.459927 -2.750753 3.087908
H  1.025961 -2.863337 2.158124
H  -3.015011 -3.699944 -4.164663
H  -1.783298 -4.933878 -4.073569
H  1.83385 -2.147659 0.104904
H  3.147456 1.705647 -1.197523
H  -4.344775 -4.863152 -2.387705
H  -3.977579 -5.972905 -3.696542
H  -3.061812 -6.053102 -2.196908
H  -1.900239 3.45463 3.40344
H  -3.115086 1.991594 1.001012
H  -5.136208 2.431505 2.48408
H  -4.309498 3.826951 3.189041
H  -4.800314 3.831505 1.49099
totalener: -1261.15636038 hartree
nucrepener: 2426.18716249 hartree
electener: -3687.34352287 hartree
oneelecener: -6539.31782390 hartree
twoeener: 2851.97430103 hartree
kineticenergy: 1256.04013022 hartree
xcener: -118.901536985254 hartree
chargesum: 0.0000000
charge: -0.294123 -0.321407 -0.313801 -0.333249 -0.327456 -0.308477 0.505212 0.511035 0.060828 -0.185796 -0.106195 -0.146130 -0.002048 -0.110325 -0.275266 -0.118628 0.170058 -0.054150 0.079759 -0.114187 -0.050043 -0.257953 0.363470 -0.219032 -0.040494 -0.192585 0.050469 0.080156 0.070971 0.068974 0.070380 0.075064 0.063334 0.072095 0.060572 0.110571 0.092690 0.082624 0.055447 0.070525 0.146609 0.166892 0.074493 0.088665 0.076293 0.112769 0.116704 0.092126 0.083649 0.098911
qa: -0.2941 -0.3214 -0.3138 -0.3332 -0.3275 -0.3085 0.5052 0.5110 0.0608 -0.1858 -0.1062 -0.1461 -0.0020 -0.1103 -0.2753 -0.1186 0.1701 -0.0542 0.0798 -0.1142 -0.0500 -0.2580 0.3635 -0.2190 -0.0405 -0.1926 0.0505 0.0802 0.0710 0.0690 0.0704 0.0751 0.0633 0.0721 0.0606 0.1106 0.0927 0.0826 0.0554 0.0705 0.1466 0.1669 0.0745 0.0887 0.0763 0.1128 0.1167 0.0921 0.0836 0.0989
va: 2.0598 1.9074 1.9360 1.9252 1.9285 2.1890 4.1394 4.1746 3.8216 3.8976 3.8874 3.8966 3.6434 3.8678 3.9422 3.9108 4.0903 4.0263 3.8990 4.1451 4.1383 3.9309 4.2588 3.9510 3.8609 3.9488 1.0323 1.0137 1.0111 1.0132 1.0157 1.0100 1.0076 1.0123 1.0103 1.0062 1.0051 1.0040 1.0095 1.0078 1.0281 1.0381 1.0014 1.0071 1.0020 1.0205 1.0194 0.9999 1.0097 0.9982
dispcorr: -0.024615726 hartree
energy: -1261.180976105809
dipole: -42.64078 39.92434 -2.71644 -36.55018 35.56227 -0.98791 -3.82620 4.52305 0.69684
magnitude: 2.97332 au
magnitude: 7.55757 debye
