program: Gaussian 09
title: 000074350
version: EM64L-G09RevD.01
frameworkgroup: C1[X(C9H12O)]
method: RPBEPBE
basis: SDD
operation: Freq
keyword: #pfreq=noraman
keyword: PBEPBE/SDD
title: #p freq=noraman PBEPBE/SDD
converged: NO YES NO NO
title: Mulliken charges:
elementType: O C C C C C C C C C H H H H H H H H H H H H
charge: -0.273620 0.334176 0.206470 0.471585 -0.513899 -0.381437 -0.441490 -0.785923 -0.814779 -0.536526 0.237828 0.228398 0.227767 0.236392 0.236246 0.211118 0.222463 0.223906 0.231265 0.218834 0.218922 0.242306
chargesum: 0.00000
title: Mulliken charges with hydrogens summed into heavy atoms:
elementType: O C C C C C C C C C
charge: -0.273620 0.334176 0.206470 0.471585 -0.276071 -0.153039 -0.213723 -0.102167 -0.137146 0.143535
polarizability: 1.28955533e+02 2.38149192e-01 1.15044706e+02 2.04822170e-01 -1.74183137e-01 5.60776769e+01
1716.lowfreq: -32.2624 -8.1944 -4.5147 0.0001 0.0004 0.0006 8.2780 94.1935 127.9011
frequency: -30.9716 94.1908 127.8992 134.0981 191.0348 196.4369 264.6857 269.4132 318.8004 350.5385 448.4039 450.6787 505.4004 530.5078 587.2165 702.8209 722.1635 754.1840 813.3540 854.1594 899.8715 942.0955 980.0318 1006.2908 1012.9506 1044.3396 1048.5296 1113.7633 1131.6905 1150.3758 1164.2221 1215.2590 1262.9493 1283.7622 1378.5038 1394.1584 1397.2747 1406.0695 1442.9275 1457.1690 1465.5736 1466.7470 1470.8969 1472.9456 1480.7742 1508.4405 1594.0113 1620.6899 2954.2160 2972.3446 2981.2025 3039.2889 3050.9798 3059.2358 3082.8718 3088.2207 3117.2310 3120.7016 3139.1838 3144.2721
redmass: 1.0228 2.3882 1.2537 2.4080 1.9166 2.9620 1.4918 2.6380 3.3363 3.0109 2.9920 4.2951 3.5386 5.2128 3.7507 5.7305 2.9271 4.1427 1.2613 1.4268 3.8508 1.3385 1.9093 1.4855 2.8722 1.5436 1.5170 1.2632 2.3338 1.3848 1.6899 1.8489 5.0245 1.3727 4.1364 1.2613 1.5285 2.0180 1.2643 1.0456 1.0520 1.0873 1.0529 1.0848 1.1259 2.9439 5.9200 6.7833 1.0332 1.0379 1.0362 1.1035 1.0965 1.0968 1.0989 1.1003 1.0873 1.0989 1.0919 1.0950
irintensity: 0.3419 4.2441 4.2086 3.4104 0.1082 2.2341 0.0033 1.2062 0.0067 2.6120 5.6003 1.6130 0.7196 7.6782 7.6942 2.2714 0.4330 2.1118 45.0377 12.3539 7.1697 0.4550 8.0902 10.3377 35.5785 8.6330 13.9152 0.2674 81.0804 0.1982 20.3934 1.1773 91.6769 0.0733 5.3308 13.7957 15.8597 17.9529 5.3508 11.1008 10.8088 7.9264 14.3762 48.8959 29.7155 46.4400 29.0328 30.2409 64.7422 44.4294 33.2520 49.3808 25.5659 21.0511 20.3174 22.1863 15.1951 26.2363 32.0024 7.5520
temp: 298.150 k
press: 1.00000 atm
elementType: 8 6 6 6 6 6 6 6 6 6 1 1 1 1 1 1 1 1 1 1 1 1
symmnumber: 1
zpe: 483758.2 jmol-1
zpe.correction: 0.184254 hartree
zpe.thermalcorrener: 0.194056 hartree
zpe.thermalcorrenthalpy: 0.195001 hartree
zpe.thermalcorrgfe: 0.149546 hartree
zpe.sumelectzpe: -424.619039 hartree
zpe.sumelectthermal: -424.609236 hartree
zpe.sumelectthermalent: -424.608292 hartree
zpe.sumelectthermalfe: -424.653747 hartree
dipole: 0.2537 -1.7125 0.0384
dipole: 1.7316
quadrupole: -56.9425 -50.8095 -63.7701
quadrupole: 2.2054 0.1098 -0.0257
quadrupole: 0.2315 6.3645 -6.5960 2.2054 0.1098 -0.0257
hfenergy: -424.8032928 hartree
pointgroup: C01 [X(C9H12O1)]
dipole: 0.0802403 -0.6763498 0.0151473 debye
dipolederiv: -1.0797793 -0.6602535 0.0021856 -0.5734463 -0.8674566 0.0005542 0.0017114 -0.0012445 -0.2902576 0.049996 -0.2021102 -0.0021847 -0.4118696 -0.1090994 0.0024142 -0.0017553 0.0004169 -0.0659733 0.9837854 0.6863452 -0.0011548 0.5586283 0.3595638 0.0011135 -0.004924 0.0041798 0.0809586 0.2645209 -0.0412652 0.0094606 -0.2074932 0.2238984 -0.0063999 0.0553862 -0.0331542 -0.0248609 -0.3822484 -0.1273633 -0.000348 0.1193692 -0.0276214 -0.0061623 -0.0071942 -0.0004221 -0.2349462 0.1172537 0.0596983 -0.002624 0.0048387 0.1109585 -0.0037264 -0.0066407 0.0014658 -0.1601176 -0.1307255 0.0552783 0.0016778 0.2206713 -0.1849251 0.0032959 -0.0017608 0.0027373 -0.2055469 -0.1217721 0.090562 -0.0000048 0.0466905 0.1056074 -0.0001917 0.0014941 -0.0012649 0.0727079 -0.03765 0.0715078 -0.0050554 0.1201647 -0.0045907 0.0039014 -0.0650307 0.0407482 0.0746035 0.2656346 0.0706001 0.0003724 0.3558913 0.7329263 -0.0000723 0.0009691 0.0005507 0.3272642 0.0984329 -0.0016733 0.0022157 -0.0127976 -0.1163826 -0.0001999 0.0026978 -0.0036507 0.1584467 0.0805526 0.014229 0.0010132 0.0004275 -0.1435471 0.0004917 0.0022662 0.0004015 0.1483145 -0.1111277 -0.0858221 0.0028509 -0.0744709 0.0467182 -0.0019365 0.0066095 0.0002928 0.1629728 -0.0161829 0.0327285 -0.0920366 0.0040304 0.0742563 -0.0606728 -0.1296176 -0.0069922 -0.0420858 -0.0148567 0.0333018 0.0917365 0.0051576 0.0739167 0.0609124 0.1292643 0.0067448 -0.0439109 0.0642317 -0.0958838 0.0002348 0.0181538 -0.1694909 0.0000184 0.0003073 0.0004796 0.1041317 0.0459186 -0.0139701 -0.0365029 0.0496269 -0.06551 -0.1208112 0.0339498 -0.1362004 0.0065251 -0.0852515 -0.0473795 0.0428113 -0.1490439 0.0075183 0.0437544 0.060749 0.018033 0.0929514 0.0162973 0.0574417 -0.0147858 0.0786363 0.03558 0.0831567 -0.0778376 0.1071597 -0.0932191 0.0661756 0.1037488 -0.1109362 -0.0525629 -0.069309 0.0564558 -0.0572026 0.0989247 -0.0926859 0.067552 0.1021251 0.1104674 -0.0535679 -0.0684245 -0.0558694 0.0557461 -0.0994116 -0.0947695 -0.1407572 -0.1018456 0.0006071 -0.0470343 0.0554136 -0.0000262 0.0008127 0.0002056 0.1194973 unknown
polarizability: 128.9579993|-0.165491|115.0425244|0.1186801|-0.1909725|56.0773928 unknown
InChI: InChI=1S/C9H12O/c1-7-4-5-8(2)9(6-7)10-3/h4-6H,1-3H3
charge 0 multiplicity 1
22 atoms
O  -2.000711 -0.807271 0.003207
C  -0.67288 1.176498 0.002109
C  -0.706564 -0.249924 0.000677
C  1.749754 -0.378566 -0.010565
C  0.481019 -1.016002 -0.006907
C  0.597251 1.790142 -0.00441
C  1.794738 1.033879 -0.012261
C  -1.961058 1.972775 0.006545
C  3.02335 -1.208439 0.005459
C  -2.113061 -2.264872 -0.00135
H  0.438035 -2.110634 -0.010428
H  0.649221 2.885795 -0.006956
H  2.763524 1.546521 -0.020446
H  -2.582988 1.731422 -0.875184
H  -2.576331 1.732567 0.89326
H  -1.753798 3.05668 0.005081
H  2.96649 -2.054181 -0.704267
H  3.902659 -0.598043 -0.263664
H  3.210881 -1.636287 1.009604
H  -1.645417 -2.710423 0.898953
H  -1.652673 -2.704085 -0.908484
H  -3.193542 -2.471652 0.002226
