program: Orca
programVersion: 4.2.1
elementType: O O O O O O N N C C C C C C C C C C C C C C C C C C H H H H H H H H H H H H H H H H H H H H H H H H
charge: 0
multiplicity: 1
keywords: wb97x-d3
keywords: def2-TZVPP
keywords: def2/J RIJCOSX GRIDX6 NOFINALGRIDX
keywords: grid4 nofinalgrid
keywords: scfconv7
keywords: smallprint printgap noloewdin
keywords: NOSOSCF
formula: C18H24N2O6
InChI: InChI=1/C18H24N2O6/c1-4-6-7-8-10-13(3)15-11-14(19(22)23)12-16(20(24)25)18(15)26-17(21)9-5-2/h5,9,11-13H,4,6-8,10H2,1-3H3
50 atoms
O  -0.618963 1.063678 0.376153
O  0.192804 3.2977 -0.898528
O  2.164923 3.887396 -0.306485
O  4.942652 -1.596822 -0.285756
O  5.461978 0.413708 -0.80758
O  -0.138633 2.495735 2.038058
N  1.300721 3.069239 -0.480384
N  4.679004 -0.43297 -0.459596
C  0.009239 -1.611842 0.814841
C  -0.748917 -2.107984 -0.42703
C  -1.932706 -3.014084 -0.112848
C  -2.747077 -3.360653 -1.35351
C  1.045399 -0.59324 0.394753
C  -3.932499 -4.267958 -1.047522
C  0.608162 -2.761052 1.621469
C  -4.729783 -4.69642 -2.276252
C  0.683537 0.74189 0.190249
C  2.361405 -0.959635 0.159838
C  1.643031 1.674247 -0.208642
C  3.296366 -0.017616 -0.231006
C  2.959352 1.307402 -0.407121
C  -5.416713 -3.548201 -3.003973
C  -0.951571 2.003728 1.314673
C  -2.394007 2.253548 1.282674
C  -2.942778 3.140082 2.112111
C  -4.386888 3.483642 2.149866
H  -0.711957 -1.106465 1.463055
H  -0.047129 -2.631361 -1.085686
H  -1.108834 -1.246097 -0.995763
H  -2.581564 -2.522002 0.62041
H  -1.588962 -3.939526 0.358189
H  -2.098663 -3.84767 -2.090288
H  -3.092682 -2.434312 -1.822069
H  -3.569087 -5.162211 -0.531709
H  -4.600614 -3.764883 -0.339757
H  -0.180834 -3.354848 2.079417
H  1.198034 -3.440356 1.00328
H  1.246169 -2.396403 2.426955
H  -4.06922 -5.225927 -2.969528
H  -5.484473 -5.424479 -1.968192
H  2.669628 -1.985645 0.297943
H  3.696383 2.040619 -0.699664
H  -4.701497 -2.844519 -3.43052
H  -6.033493 -3.915037 -3.824563
H  -6.067669 -2.987798 -2.330208
H  -2.988782 1.711823 0.557456
H  -2.296343 3.661826 2.81101
H  -4.795148 3.315413 3.147834
H  -4.530141 4.543948 1.933387
H  -4.97118 2.90627 1.435768
totalener: -1261.15840371 hartree
nucrepener: 2368.54525390 hartree
electener: -3629.70365761 hartree
oneelecener: -6424.16687823 hartree
twoeener: 2794.46322062 hartree
kineticenergy: 1256.03775952 hartree
xcener: -118.899923990732 hartree
chargesum: 0.0000000
charge: -0.292139 -0.322202 -0.313800 -0.334549 -0.327892 -0.321676 0.501992 0.511465 0.121450 -0.173733 -0.131215 -0.123186 0.009705 -0.110939 -0.319802 -0.111309 0.143463 -0.078464 0.058795 -0.107963 -0.041984 -0.260749 0.376413 -0.241423 -0.013367 -0.197511 0.058397 0.080306 0.083910 0.064277 0.065397 0.062321 0.061365 0.066791 0.058644 0.098912 0.083925 0.120331 0.054647 0.070059 0.156837 0.166251 0.075003 0.088830 0.074799 0.104763 0.129565 0.094665 0.099485 0.081139
qa: -0.2921 -0.3222 -0.3138 -0.3345 -0.3279 -0.3217 0.5020 0.5115 0.1214 -0.1737 -0.1312 -0.1232 0.0097 -0.1109 -0.3198 -0.1113 0.1435 -0.0785 0.0588 -0.1080 -0.0420 -0.2607 0.3764 -0.2414 -0.0134 -0.1975 0.0584 0.0803 0.0839 0.0643 0.0654 0.0623 0.0614 0.0668 0.0586 0.0989 0.0839 0.1203 0.0546 0.0701 0.1568 0.1663 0.0750 0.0888 0.0748 0.1048 0.1296 0.0947 0.0995 0.0811
va: 2.1054 1.9066 1.9358 1.9223 1.9292 2.1852 4.1410 4.1746 3.7302 3.8626 3.8770 3.8906 3.7583 3.8867 3.9425 3.9043 4.1091 4.0391 3.9146 4.1513 4.1355 3.9318 4.2033 3.9514 3.8478 3.9515 1.0234 1.0131 1.0208 1.0093 1.0118 1.0099 1.0113 1.0132 1.0099 0.9998 1.0002 1.0026 1.0093 1.0076 1.0238 1.0379 1.0012 1.0066 1.0021 1.0248 1.0184 0.9995 0.9986 1.0103
dispcorr: -0.022885119 hartree
energy: -1261.181288825224
dipole: -53.46026 50.75720 -2.70307 -37.50357 36.39113 -1.11245 -3.48788 4.02052 0.53263
magnitude: 2.97116 au
magnitude: 7.55209 debye
