program: Gaussian 09
title: 000074362
version: EM64L-G09RevD.01
frameworkgroup: C1[X(C10H12O3)]
method: RPBEPBE
basis: SDD
operation: Freq
keyword: #pfreq=noraman
keyword: PBEPBE/SDD
title: #p freq=noraman PBEPBE/SDD
converged: YES YES NO NO
title: Mulliken charges:
elementType: O O O C C C C C C C C C C H H H H H H H H H H H H
charge: -0.253626 -0.252428 -0.432712 -0.077127 -0.057194 -0.356992 -0.355641 0.355770 -0.388356 -0.386201 -0.219232 -0.219565 -0.236682 0.225037 0.196780 0.187594 0.258419 0.258299 0.187141 0.263112 0.261959 0.360008 0.226795 0.226805 0.228036
chargesum: 0.00000
title: Mulliken charges with hydrogens summed into heavy atoms:
elementType: O O O C C C C C C C C C C
charge: -0.253626 -0.252428 -0.072704 0.147909 0.139586 0.089021 0.089799 0.355770 -0.125244 -0.124242 0.007564 0.007240 -0.008646
polarizability: 1.51070962e+02 6.02366631e-02 1.12148687e+02 -1.18044545e+01 -1.35479486e-01 7.16693259e+01
1716.lowfreq: -14.2111 -8.1347 -5.3964 -0.0012 -0.0009 -0.0009 29.7803 64.2409 131.1588
frequency: 29.5754 64.2325 131.1378 149.2374 176.4595 232.7438 293.9073 368.1564 382.0539 390.9777 403.4532 425.1279 458.5466 500.4236 550.6888 615.3961 634.7125 702.4815 743.7919 776.9072 790.3908 860.7888 864.3869 866.8176 892.8260 917.9988 927.8849 940.5814 956.4308 985.7104 990.4305 999.7238 1017.7886 1033.2343 1075.0380 1084.3513 1107.7614 1172.3307 1183.9706 1194.5990 1198.5590 1214.1946 1283.9934 1285.7379 1308.0776 1319.9774 1346.7076 1347.3676 1362.3394 1372.0034 1384.5316 1435.5643 1439.1187 1449.0408 1484.4968 1594.6924 1617.8162 2864.1247 2949.2700 2958.9378 3052.9882 3107.6248 3110.2010 3125.3032 3137.5602 3153.6166 3166.3705 3173.0388 3532.4303
redmass: 3.9992 5.7530 4.9632 4.6590 3.3859 5.5420 5.1395 2.0648 2.5742 1.9332 2.8643 1.8387 3.6049 5.3630 5.5830 6.4309 5.3618 2.1642 1.6002 5.1056 4.0225 1.2795 2.6327 3.7509 2.5950 3.4715 3.3402 1.9521 2.7186 1.3795 6.0627 1.3247 3.7972 2.2593 1.8869 1.5734 2.3000 1.0529 1.1141 1.0831 1.1234 1.8352 1.8000 1.4656 1.2379 1.2290 1.2575 1.7272 1.3166 1.1894 8.3293 1.8667 1.1910 1.0973 2.4389 6.4105 6.1469 1.0809 1.0681 1.0682 1.0863 1.0949 1.0971 1.0850 1.0894 1.0944 1.0950 1.0992 1.0652
irintensity: 0.6268 1.0565 3.0122 6.2156 7.6262 4.0003 3.6858 16.3798 5.6471 2.7639 0.0097 89.9709 0.0793 6.8968 14.2447 0.1879 3.7136 35.5337 94.6819 7.6934 18.5357 3.4624 0.3503 17.0799 67.6876 16.0961 43.6947 7.7304 21.6289 0.0001 0.8962 0.2997 164.4468 30.6402 6.2609 4.3053 69.0383 0.0053 9.7855 9.2552 56.2511 5.0444 0.6860 16.3865 0.0028 1.9583 1.4631 87.8289 9.3913 34.6222 0.0510 4.0116 20.1276 15.1560 6.6335 0.1266 0.4084 61.0768 17.5873 111.2051 45.3690 16.7271 16.3288 0.0370 15.3532 28.2287 15.3826 8.7151 9.4361
temp: 298.150 k
press: 1.00000 atm
elementType: 8 8 8 6 6 6 6 6 6 6 6 6 6 1 1 1 1 1 1 1 1 1 1 1 1
symmnumber: 1
zpe: 530356.8 jmol-1
zpe.correction: 0.202002 hartree
zpe.thermalcorrener: 0.213188 hartree
zpe.thermalcorrenthalpy: 0.214132 hartree
zpe.thermalcorrgfe: 0.164187 hartree
zpe.sumelectzpe: -612.927616 hartree
zpe.sumelectthermal: -612.916431 hartree
zpe.sumelectthermalent: -612.915486 hartree
zpe.sumelectthermalfe: -612.965432 hartree
dipole: 0.1644 0.0164 -2.8525
dipole: 2.8573
quadrupole: -70.3409 -72.9687 -78.9638
quadrupole: 0.0837 -11.2341 -0.0746
quadrupole: 3.7503 1.1225 -4.8727 0.0837 -11.2341 -0.0746
hfenergy: -613.1296187 hartree
pointgroup: C01 [X(C10H12O3)]
dipole: -0.0451832 0.3683237 -1.0611216 debye
dipolederiv: -0.9575898 0.2381224 0.0910042 0.1654386 -0.6609615 -0.0352225 0.1907985 -0.1243709 -0.438132 -1.0192736 -0.1945058 -0.0638884 -0.2024826 -0.5924265 -0.109777 0.0718679 -0.0398008 -0.4414604 -0.23028 -0.0364615 0.0300881 -0.0643779 -0.6063346 0.04887 0.1120629 0.041952 -0.7477024 0.1485181 0.0026565 0.0105896 0.0397117 0.2640142 -0.1059954 -0.1008551 -0.0968451 0.547669 1.1097586 0.0009196 -0.0478076 0.0964652 0.8739521 0.0888153 -0.3280545 0.1111662 0.654806 0.6276971 -0.1963332 0.0184509 -0.0918077 0.2238632 -0.0240107 0.0773061 -0.1211004 0.2309268 0.6532512 0.077377 0.1119877 -0.0463836 0.1412982 -0.0505143 0.1083161 0.0420574 0.287442 -0.0137847 -0.0189156 0.0447522 -0.034713 -0.048962 -0.0046447 0.0929526 -0.0085475 -0.0467559 -0.081228 -0.0816771 -0.0157906 0.0075736 0.0052537 0.0378213 -0.0123028 0.0509213 -0.1179406 -0.0670675 0.0858915 0.0442048 0.0143165 -0.0104344 0.0517985 -0.011729 0.0418064 -0.1147229 -0.0289197 0.0903846 0.0662074 0.0881723 0.0265548 0.0823142 0.0681389 0.0856318 -0.1100304 -0.0574036 -0.0940606 -0.0025566 -0.0934217 0.082186 0.0562563 -0.0000518 0.0525585 -0.1379146 0.0805019 -0.0282488 0.053178 -0.0270204 -0.0533495 0.0287324 0.0505425 0.0288719 -0.1377677 -0.1617983 0.0448464 -0.0748303 0.0215215 0.0779363 0.0287568 -0.0052811 0.0232051 0.0206418 -0.1276064 0.0430556 -0.1053312 -0.0036984 -0.0589846 0.0607181 0.0292921 0.0509222 -0.1936834 -0.0432242 0.0041737 0.0267095 -0.0125538 0.0283974 0.0784393 -0.0832597 0.157642 -0.1668141 0.0023242 0.045926 0.0168658 0.0587805 -0.0171603 -0.0697593 0.0422159 -0.1139185 0.0258492 -0.0167634 -0.055853 -0.0113006 -0.0832932 -0.071369 -0.0123922 0.006955 0.0281272 0.0990062 -0.0376499 -0.0028283 0.0231972 0.080878 0.061882 0.0957267 -0.0641223 0.0321499 -0.2079318 0.1249076 0.0650849 0.0046377 0.073702 -0.0135703 -0.0349517 0.0024539 -0.0422487 0.1355666 0.1008447 -0.070342 -0.0465547 -0.0753828 0.0243422 -0.0597111 -0.052241 -0.0515556 0.1185545 0.0888246 0.037383 -0.0590045 0.0421386 0.3329195 -0.0000163 -0.0709585 0.0018415 0.3468961 0.0041947 -0.0762133 -0.0592767 -0.0918293 -0.0247954 -0.0826941 -0.0671052 -0.0802156 0.1136468 0.0311137 0.0831426 0.000614 0.1001286 -0.0763804 -0.0546459 0.0040046 -0.0566711 0.138407 -0.1293474 0.0364756 -0.0561459 0.038137 0.0921289 -0.0139136 -0.0609461 -0.0135793 0.1414442 unknown
polarizability: 150.4229763|-7.0047666|108.4888935|11.504814|11.8891299|75.9771053 unknown
InChI: InChI=1S/C10H12O3/c11-9-6-12-10(13-7-9)8-4-2-1-3-5-8/h1-5,9-11H,6-7H2
charge 0 multiplicity 1
25 atoms
O  -1.057759 1.300962 0.36666
O  -1.236292 -0.983859 -0.408325
O  -3.385539 -0.17434 1.498293
C  -3.296925 0.284689 0.11051
C  -0.506911 0.28325 -0.535918
C  -2.469858 1.584737 0.01278
C  -2.657135 -0.795202 -0.788584
C  0.950166 0.053671 -0.195149
C  1.726287 1.10502 0.349071
C  1.551841 -1.199463 -0.464722
C  3.097859 0.902933 0.620616
C  2.923706 -1.39741 -0.192291
C  3.701262 -0.346726 0.348115
H  -4.341402 0.469884 -0.197707
H  -0.643799 0.650217 -1.585043
H  -2.522303 2.014373 -1.01169
H  -2.813244 2.324007 0.751564
H  -3.134678 -1.772938 -0.626644
H  -2.72523 -0.509388 -1.861388
H  1.247244 2.06336 0.570393
H  0.938519 -2.011241 -0.867002
H  -2.457299 -0.344482 1.808798
H  3.693421 1.718128 1.046627
H  3.383984 -2.370241 -0.39832
H  4.765587 -0.50154 0.558557
