program: Gaussian 09
title: 000074386
version: EM64L-G09RevD.01
frameworkgroup: C1[X(C10H13Cl2OPS2)]
method: RPBEPBE
basis: SDD
operation: Freq
keyword: #p
keyword: freq=noraman
keyword: PBEPBE/SDD
title: #p freq=noraman PBEPBE/SDD
converged: NO YES NO NO
title: Mulliken charges:
elementType: Cl Cl S S P O C C C C C C C C C C H H H H H H H H H H H H H
charge: 0.008001 -0.044082 0.055193 -0.214218 0.508523 -0.483269 0.031950 -0.654604 -0.663096 -0.720055 -0.226821 -0.210719 -0.167966 -0.192103 -0.192586 -0.093696 0.233214 0.213286 0.235055 0.226060 0.207586 0.240990 0.224807 0.306614 0.319400 0.258491 0.269968 0.261502 0.262575
chargesum: 0.00000
title: Mulliken charges with hydrogens summed into heavy atoms:
elementType: Cl Cl S S P O C C C C C C C C C C
charge: 0.008001 -0.044082 0.055193 -0.214218 0.508523 -0.483269 0.265164 0.019796 0.010286 -0.094041 -0.226821 0.047773 0.102003 0.069399 0.069989 -0.093696
polarizability: 2.95801665e+02 -7.36231537e-01 1.57878993e+02 -2.85495049e+00 -5.45741281e+00 1.68876288e+02
1716.lowfreq: -15.0879 -10.3727 -7.0868 -0.0019 -0.0014 0.0021 5.6081 9.8008 25.5919
frequency: -6.6664 -3.7951 25.5891 36.4681 44.4643 65.4510 83.1682 103.2719 115.7754 129.5020 151.0087 180.2934 186.1810 203.6228 219.7520 231.9902 297.3750 304.0635 316.0722 324.2799 339.1428 393.3792 409.7668 421.7123 443.8859 487.2316 505.9359 520.0096 618.0209 638.3121 656.9922 696.9424 715.7783 727.9838 819.7776 825.6684 828.0674 838.2484 904.7584 926.0471 936.1490 948.1448 963.7211 989.5715 1062.3287 1070.3627 1095.8264 1100.8585 1142.5614 1153.6513 1178.9044 1180.1763 1231.4024 1282.5688 1323.5801 1332.5851 1357.1346 1379.3482 1380.6568 1381.8568 1395.7293 1452.1387 1453.5573 1461.7334 1468.1673 1482.9528 1570.6793 1572.8311 2988.4148 2992.5990 2994.1982 3071.3899 3085.4412 3092.5012 3098.3317 3107.2220 3150.7289 3162.6879 3170.1541 3174.4809 3182.0314
redmass: 3.8621 4.2014 7.3949 5.2818 5.4335 6.4415 11.1252 10.4840 5.2600 7.8091 8.0917 1.0594 2.5468 12.6894 1.7998 2.4343 6.8080 5.5892 3.8007 5.1340 6.0733 8.2449 2.9014 4.0685 3.0498 3.3254 8.4393 7.9753 7.1645 7.1207 4.4138 4.0003 7.2962 8.2599 1.3551 1.4001 4.1144 1.5816 3.0500 1.2353 1.3283 1.3314 1.3661 5.7543 5.6411 2.0948 1.6422 1.3689 1.0495 2.0735 1.9474 1.1190 1.1299 1.2393 1.1894 1.4604 4.3123 1.0918 1.2285 4.3839 1.2157 2.0961 1.0614 1.0489 1.0481 1.0505 6.5396 7.4717 1.0359 1.0836 1.0377 1.0539 1.0990 1.0995 1.1004 1.1007 1.0893 1.0890 1.1120 1.0969 1.0980
irintensity: 0.0623 0.0274 0.1639 1.0290 0.9659 0.4318 0.5282 2.0567 6.2686 1.8453 2.1217 0.1150 1.5408 1.6476 0.1227 1.5378 4.1727 4.4276 4.2861 0.8378 0.3130 40.5438 2.0427 33.0947 16.6954 27.6572 19.1120 35.0827 0.1948 30.9155 38.0217 0.1775 10.1702 26.4582 25.9577 46.7919 186.6797 26.5564 96.2484 3.0782 0.0567 0.7584 0.8854 63.8312 10.8034 52.1682 103.0126 7.7761 3.7065 10.6008 17.2409 3.3397 9.3981 1.4646 27.0043 6.1979 0.7158 9.5602 25.5747 11.2034 25.6879 68.5265 11.7900 1.7662 11.4599 12.7210 26.9674 11.4988 12.3597 7.6982 26.7921 1.5473 18.6285 31.6981 24.9516 24.4984 1.4302 1.2982 0.3404 3.5752 0.6878
temp: 298.150 k
press: 1.00000 atm
elementType: 17 17 16 16 15 8 6 6 6 6 6 6 6 6 6 6 1 1 1 1 1 1 1 1 1 1 1 1 1
symmnumber: 1
zpe: 546426.3 jmol-1
zpe.correction: 0.208123 hartree
zpe.thermalcorrener: 0.226100 hartree
zpe.thermalcorrenthalpy: 0.227044 hartree
zpe.thermalcorrgfe: 0.159704 hartree
zpe.sumelectzpe: -2520.347526 hartree
zpe.sumelectthermal: -2520.329549 hartree
zpe.sumelectthermalent: -2520.328605 hartree
zpe.sumelectthermalfe: -2520.395945 hartree
dipole: 1.2628 -1.3117 -1.8284
dipole: 2.5804
quadrupole: -131.1118 -129.7414 -133.2566
quadrupole: -9.2336 2.7800 -9.7092
quadrupole: 0.2581 1.6285 -1.8866 -9.2336 2.7800 -9.7092
hfenergy: -2520.5556483 hartree
pointgroup: C01 [X(C10H13Cl2O1P1S2)]
dipole: -0.5090391 0.4702507 -0.7418767 debye
polarizability: 294.0332985|12.5756687|158.995935|8.6813143|6.2688033|169.5277121 unknown
InChI: InChI=1S/C6H4ClS.C4H9ClOPS/c7-5-1-3-6(8)4-2-5;1-4(2)6-7(8)3-5/h1-4H;4H,3H2,1-2H3
charge 0 multiplicity 1
29 atoms
Cl -2.268643 -3.598907 0.099209
Cl 5.756127 0.235842 1.052089
S  -0.144726 0.666046 -1.530887
S  -0.956883 -0.414989 2.008852
P  -1.432741 -0.596391 0.00873
O  -3.038626 -0.184945 -0.51232
C  -3.859005 0.805787 0.271648
C  -3.466495 2.235869 -0.121741
C  -5.308128 0.442493 -0.063421
C  -1.313499 -2.284231 -0.808049
C  1.5127 0.514644 -0.758728
C  2.48627 -0.319602 -1.362903
C  1.834998 1.261538 0.401079
C  3.786169 -0.403431 -0.817806
C  3.129085 1.172993 0.961131
C  4.083647 0.344247 0.339958
H  -3.64884 0.6280 1.345909
H  -4.110226 2.958842 0.412371
H  -2.416103 2.453881 0.13866
H  -3.597053 2.38716 -1.207564
H  -5.996543 1.097074 0.50164
H  -5.518632 -0.60635 0.203841
H  -5.502313 0.578061 -1.141694
H  -0.257998 -2.588972 -0.829301
H  -1.734759 -2.190876 -1.818987
H  2.232371 -0.894302 -2.259324
H  1.081978 1.902512 0.867288
H  4.546317 -1.038434 -1.281415
H  3.385049 1.739641 1.860538
