program: Gaussian 09
title: 000069414
version: EM64L-G09RevD.01
frameworkgroup: C1[X(C8H17NO)]
method: RPBEPBE
basis: SDD
operation: Freq
keyword: #p
keyword: freq=noraman
keyword: PBEPBE/SDD
title: #p freq=noraman PBEPBE/SDD
converged: YES YES NO NO
title: Mulliken charges:
elementType: O N C C C C C C C C H H H H H H H H H H H H H H H H H
charge: -0.256809 -0.621177 -0.372115 -0.366645 -0.351228 -0.369331 -0.356055 -0.537020 -0.696255 0.224284 0.192207 0.192046 0.184670 0.184690 0.185991 0.185984 0.219346 0.220939 0.195707 0.195753 0.232899 0.234037 0.209160 0.209141 0.215584 0.331279 0.312917
chargesum: 0.00000
title: Mulliken charges with hydrogens summed into heavy atoms:
elementType: O N C C C C C C C C
charge: -0.256809 0.023019 0.012138 0.002715 0.020746 0.070954 0.035405 -0.070083 -0.062370 0.224284
polarizability: 1.24670371e+02 -3.28846466e+00 9.25078958e+01 -7.21848249e-02 5.44105766e-02 7.33320136e+01
1716.lowfreq: -29.0056 -0.0006 -0.0005 0.0002 4.4115 9.0820 36.7952 39.8542 58.5258
frequency: -20.0227 37.8375 58.5187 74.0105 89.0065 137.1166 142.8665 147.3456 224.8044 226.6770 270.1741 401.1439 416.4809 480.8252 490.3612 514.5035 587.9352 626.3960 723.8899 730.2697 764.4444 830.4775 835.3805 888.2424 910.9821 996.0394 1002.0609 1020.3392 1051.6806 1063.0394 1080.9705 1087.1809 1106.0330 1121.9649 1189.0490 1213.4588 1231.3949 1251.7375 1274.1509 1281.5936 1290.5898 1294.8293 1297.4215 1327.3443 1352.8763 1358.3837 1369.9413 1387.3348 1445.3948 1462.3905 1464.2514 1469.0390 1475.6816 1476.0533 1483.7390 1489.4922 1595.7199 1644.5595 2947.5689 2951.3373 2959.9917 2963.0486 2969.3231 2971.0061 2984.8356 2993.6240 2999.7095 3010.3547 3015.4490 3034.8284 3063.6019 3067.5040 3070.3262 3515.3965 3672.6444
redmass: 2.5099 3.5379 3.9674 1.6075 2.6422 1.7913 2.1406 3.9868 1.1328 4.5483 3.3675 2.9190 3.5856 1.3555 2.7329 1.2891 4.2694 1.4405 1.0658 1.1057 1.2018 1.2923 3.2304 1.8747 1.2875 1.1829 4.2983 2.7811 2.7035 2.3237 2.1037 2.2772 1.4152 2.7792 1.7178 1.3312 1.3836 1.4292 1.2250 1.0284 1.5333 1.0739 1.1316 1.6211 1.6580 1.6920 2.1661 1.2186 1.0854 1.0748 1.0681 1.0744 1.0427 1.0740 1.0845 1.0938 1.3937 3.8697 1.0589 1.0588 1.0593 1.0591 1.0574 1.0379 1.0971 1.1001 1.0602 1.0991 1.1033 1.1045 1.1036 1.1008 1.0992 1.0444 1.1044
irintensity: 5.0352 0.0327 2.6757 0.6829 0.0168 0.1285 0.0110 5.5375 0.0005 0.1144 5.5650 0.6051 3.7738 27.2010 3.4104 215.5021 3.7867 64.0290 18.1446 0.1066 7.2133 0.4710 1.2038 3.6496 3.5427 0.0131 0.0636 8.2013 0.7714 3.8209 0.6840 2.3192 0.3166 3.6037 0.1803 4.6753 0.0274 28.9685 0.2434 0.0534 45.3816 0.7484 0.0111 41.8838 27.0895 2.7571 66.3831 12.1201 14.3201 0.4194 0.2578 2.1746 12.3591 1.9980 3.3524 25.7331 67.4093 277.8942 6.5184 5.3354 17.5595 27.0176 119.1058 29.1136 3.4287 2.2652 31.1303 11.6659 0.0007 69.6712 53.8994 124.3252 54.6044 24.8183 20.7798
temp: 298.150 k
press: 1.00000 atm
elementType: 8 7 6 6 6 6 6 6 6 6 1 1 1 1 1 1 1 1 1 1 1 1 1 1 1 1 1
symmnumber: 1
zpe: 630766.8 jmol-1
zpe.correction: 0.240246 hartree
zpe.thermalcorrener: 0.252391 hartree
zpe.thermalcorrenthalpy: 0.253336 hartree
zpe.thermalcorrgfe: 0.200920 hartree
zpe.sumelectzpe: -444.213159 hartree
zpe.sumelectthermal: -444.201014 hartree
zpe.sumelectthermalent: -444.200070 hartree
zpe.sumelectthermalfe: -444.252486 hartree
dipole: 0.5124 -3.8997 -0.0245
dipole: 3.9333
quadrupole: -55.6449 -66.1581 -63.4325
quadrupole: -16.2887 -0.1109 0.0057
quadrupole: 6.1002 -4.4129 -1.6873 -16.2887 -0.1109 0.0057
hfenergy: -444.4534055 hartree
pointgroup: C01 [X(C8H17N1O1)]
dipole: -0.190145 1.5356177 -0.0214005 debye
polarizability: 124.6196242|-3.5281191|92.5567695|0.005542|-0.2002764|73.333887 unknown
InChI: InChI=1S/C8H17NO/c1-2-3-4-5-6-7-8(9)10/h2-7,9H2,1H3
charge 0 multiplicity 1
27 atoms
O  -3.600556 -1.333869 0.030077
N  -4.646448 0.732284 -0.001202
C  1.617325 -0.387465 -0.004814
C  0.380301 0.538732 0.00206
C  2.958252 0.380403 -0.00184
C  -0.953709 -0.239216 -0.001598
C  4.194104 -0.548153 -0.007346
C  -2.178974 0.69382 0.004916
C  5.530467 0.225358 -0.004082
C  -3.512589 -0.071573 0.012125
H  1.576927 -1.058152 0.87879
H  1.574894 -1.047781 -0.896114
H  0.423407 1.209723 -0.882258
H  0.424773 1.198299 0.894866
H  3.002192 1.041246 0.889576
H  3.00103 1.050232 -0.886565
H  -1.004253 -0.899424 -0.888067
H  -1.003734 -0.910017 0.87674
H  4.149188 -1.208039 -0.897849
H  4.150138 -1.217221 0.876313
H  -2.153707 1.359994 -0.882281
H  -2.144866 1.35781 0.893559
H  5.613121 0.869353 0.892001
H  5.612409 0.878215 -0.893789
H  6.397053 -0.461284 -0.007819
H  -5.561888 0.282968 0.00481
H  -4.590156 1.749058 -0.016209
