program: Orca
programVersion: 4.2.1
elementType: O O N C C C C C C C C C C C C C C C C C H H H H H H H H H H H H H H H H H H H
charge: 0
multiplicity: 1
keywords: wb97x-d3
keywords: def2-TZVPP
keywords: def2/J RIJCOSX GRIDX6 NOFINALGRIDX
keywords: grid4 nofinalgrid
keywords: scfconv7
keywords: smallprint printgap noloewdin
keywords: NOSOSCF
formula: C17H19NO2
InChI: InChI=1/C17H19NO2/c1-12(2)20-15-9-6-8-14(11-15)18-17(19)16-10-5-4-7-13(16)3/h4-12,18H,1-3H3
39 atoms
O  -4.118244 0.13048 -0.710843
O  2.021111 -2.165403 0.20868
N  0.595999 -0.402225 -0.047428
C  -4.025026 1.551004 -0.866416
C  -3.035314 -0.619457 -0.443134
C  -0.667799 -1.001142 -0.105606
C  2.934839 0.026804 0.133892
C  -1.735205 -0.135716 -0.371192
C  3.213187 0.754684 1.294672
C  -5.274445 1.969869 -1.612987
C  -3.911384 2.238667 0.481987
C  1.814911 -0.969678 0.107256
C  -3.27179 -1.982595 -0.244743
C  -0.899651 -2.35862 0.089956
C  3.721905 0.1673 -1.003278
C  -2.208476 -2.822678 0.015175
C  4.291143 1.636307 1.267936
C  2.385398 0.600995 2.537304
C  4.784717 1.057588 -1.011975
C  5.066736 1.794348 0.128753
H  -3.153861 1.795107 -1.484822
H  -1.521143 0.914692 -0.522294
H  0.598132 0.6001 -0.169506
H  -5.263713 3.046649 -1.782468
H  -5.33861 1.48218 -2.586219
H  -6.175625 1.729311 -1.046115
H  -3.834012 3.317447 0.340688
H  -3.032672 1.922654 1.044922
H  -4.793074 2.043069 1.094745
H  -4.282084 -2.367009 -0.300405
H  -0.099869 -3.048937 0.297596
H  3.498139 -0.412978 -1.890031
H  -2.39612 -3.877787 0.167492
H  4.529486 2.206384 2.157827
H  2.192866 -0.446115 2.775208
H  2.889665 1.041959 3.396308
H  1.416362 1.095361 2.443953
H  5.389451 1.17022 -1.902062
H  5.896284 2.489628 0.136425
elementType: O N C H
totalener: -864.56402187 hartree
nucrepener: 1453.29819140 hartree
electener: -2317.86221327 hartree
oneelecener: -4058.35440079 hartree
twoeener: 1740.49218753 hartree
cpcmener: -0.02904395 hartree
kineticenergy: 860.70781408 hartree
xcener: -84.968752930887 hartree
chargesum: 0.0000000
charge: -0.330202 -0.481910 -0.119291 0.154403 0.319176 0.111572 -0.011271 -0.200939 -0.074079 -0.257452 -0.261519 0.421295 -0.286360 -0.269886 -0.164864 -0.117623 -0.124253 -0.249357 -0.185640 -0.149891 0.066783 0.118458 0.174715 0.089658 0.097015 0.089997 0.096789 0.095138 0.090616 0.137620 0.155304 0.144351 0.154761 0.139401 0.108749 0.094712 0.105909 0.158394 0.159721
qa: -0.3302 -0.4819 -0.1193 0.1544 0.3192 0.1116 -0.0113 -0.2009 -0.0741 -0.2575 -0.2615 0.4213 -0.2864 -0.2699 -0.1649 -0.1176 -0.1243 -0.2494 -0.1856 -0.1499 0.0668 0.1185 0.1747 0.0897 0.0970 0.0900 0.0968 0.0951 0.0906 0.1376 0.1553 0.1444 0.1548 0.1394 0.1087 0.0947 0.1059 0.1584 0.1597
va: 2.0932 2.0142 3.2449 3.8260 3.8213 3.9113 3.6364 3.8353 3.8006 3.9255 3.9005 3.9867 4.0095 3.9698 3.9609 3.9414 3.8860 3.9310 3.9142 3.8982 0.9998 1.0229 1.0042 1.0054 1.0083 1.0077 1.0070 1.0050 1.0079 1.0128 1.0377 1.0065 0.9908 1.0001 1.0005 1.0055 0.9953 0.9916 0.9890
dispcorr: -0.016264415 hartree
energy: -864.580286285785
dipole: -12.63811 12.21188 -0.42623 13.79107 -10.96727 2.82379 2.14432 -2.22458 -0.08027
magnitude: 2.85691 au
magnitude: 7.26169 debye
