program: Orca
programVersion: 4.2.1
elementType: O O N C C C C C C C C C C C C C C C C C H H H H H H H H H H H H H H H H H H H
charge: 0
multiplicity: 1
keywords: wb97x-d3
keywords: def2-TZVPP
keywords: def2/J RIJCOSX GRIDX6 NOFINALGRIDX
keywords: grid4 nofinalgrid
keywords: scfconv7
keywords: smallprint printgap noloewdin
keywords: NOSOSCF
formula: C17H19NO2
InChI: InChI=1/C17H19NO2/c1-12(2)20-15-9-6-8-14(11-15)18-17(19)16-10-5-4-7-13(16)3/h4-12,18H,1-3H3
39 atoms
O  -3.705366 0.603138 -0.59561
O  2.844504 -1.64104 -1.653552
N  0.733661 -1.176791 -1.066473
C  -3.853597 0.828128 -2.001216
C  -2.566278 0.097247 -0.090153
C  -0.332235 -0.813035 -0.227981
C  2.581628 -0.530167 0.411851
C  -1.456877 -0.264427 -0.846756
C  2.412344 0.828987 0.693301
C  -5.343945 0.863595 -2.269047
C  -3.168243 2.117825 -2.416147
C  2.070554 -1.155966 -0.843418
C  -2.532737 -0.064972 1.296942
C  -0.313079 -1.012986 1.145788
C  3.311945 -1.348933 1.269119
C  -1.414672 -0.615568 1.892512
C  2.964948 1.320498 1.874474
C  1.671057 1.758025 -0.222375
C  3.834487 -0.844366 2.447766
C  3.655274 0.497694 2.751023
H  -3.425726 -0.016237 -2.552821
H  -1.432258 -0.123574 -1.919114
H  0.473822 -1.504997 -1.987998
H  -5.822487 -0.072008 -1.977262
H  -5.827894 1.681404 -1.732025
H  -5.525515 1.009515 -3.334017
H  -2.098868 2.114757 -2.201215
H  -3.611919 2.975504 -1.907349
H  -3.281655 2.269316 -3.490179
H  -3.389187 0.226776 1.891463
H  0.52898 -1.477227 1.636602
H  3.451381 -2.394508 1.023387
H  -1.402832 -0.758552 2.965264
H  2.853851 2.372392 2.109352
H  1.840492 1.534756 -1.275805
H  0.593481 1.715788 -0.048225
H  1.981025 2.789205 -0.055507
H  4.381467 -1.492319 3.119867
H  4.06332 0.908104 3.665772
elementType: O N C H
totalener: -864.56033574 hartree
nucrepener: 1509.28632804 hartree
electener: -2373.84666378 hartree
oneelecener: -4170.22330697 hartree
twoeener: 1796.37664319 hartree
cpcmener: -0.02807059 hartree
kineticenergy: 860.71176288 hartree
xcener: -84.972054797763 hartree
chargesum: -0.0000000
charge: -0.330543 -0.476878 -0.123618 0.156385 0.322399 0.034390 -0.019865 -0.158928 -0.004478 -0.258224 -0.262427 0.333580 -0.268672 -0.236562 -0.166468 -0.106661 -0.158078 -0.232505 -0.179058 -0.137969 0.067276 0.120198 0.167572 0.096685 0.090164 0.089737 0.095001 0.091210 0.096525 0.139266 0.153952 0.140425 0.156060 0.136921 0.109824 0.101430 0.103722 0.158571 0.159639
qa: -0.3305 -0.4769 -0.1236 0.1564 0.3224 0.0344 -0.0199 -0.1589 -0.0045 -0.2582 -0.2624 0.3336 -0.2687 -0.2366 -0.1665 -0.1067 -0.1581 -0.2325 -0.1791 -0.1380 0.0673 0.1202 0.1676 0.0967 0.0902 0.0897 0.0950 0.0912 0.0965 0.1393 0.1540 0.1404 0.1561 0.1369 0.1098 0.1014 0.1037 0.1586 0.1596
va: 2.0931 2.0334 3.1491 3.8184 3.8088 3.7928 3.5153 3.8296 3.7038 3.9271 3.9002 4.2247 3.9988 3.9501 3.9569 3.9082 3.9256 3.9134 3.9115 3.8919 1.0006 1.0248 1.0212 1.0086 1.0073 1.0053 1.0044 1.0078 1.0074 1.0123 0.9966 1.0097 0.9892 1.0013 1.0007 0.9956 1.0042 0.9904 0.9886
dispcorr: -0.018843747 hartree
energy: -864.579179490029
dipole: -14.62476 13.05775 -1.56701 11.09417 -10.14118 0.95299 -5.82659 5.96936 0.14277
magnitude: 1.83959 au
magnitude: 4.67587 debye
