program: Orca
programVersion: 4.2.1
elementType: O O N C C C C C C C C C C C C C C C C C H H H H H H H H H H H H H H H H H H H
charge: 0
multiplicity: 1
keywords: wb97x-d3
keywords: def2-TZVPP
keywords: def2/J RIJCOSX GRIDX6 NOFINALGRIDX
keywords: grid4 nofinalgrid
keywords: scfconv7
keywords: smallprint printgap noloewdin
keywords: NOSOSCF
formula: C17H19NO2
InChI: InChI=1/C17H19NO2/c1-12(2)20-15-9-6-8-14(11-15)18-17(19)16-10-5-4-7-13(16)3/h4-12,18H,1-3H3
39 atoms
O  -3.693333 0.598152 -0.59981
O  2.857364 -1.647994 -1.644836
N  0.739238 -1.203604 -1.068213
C  -3.826701 0.859725 -2.000727
C  -2.560283 0.077404 -0.095654
C  -0.33094 -0.843449 -0.233272
C  2.57419 -0.527093 0.41276
C  -1.450799 -0.285334 -0.851801
C  2.384123 0.830543 0.688242
C  -5.314352 0.925381 -2.278198
C  -3.118803 2.1485 -2.379476
C  2.074962 -1.165644 -0.841165
C  -2.53237 -0.097894 1.290083
C  -0.317145 -1.055186 1.138609
C  3.315025 -1.330719 1.275448
C  -1.419423 -0.659423 1.885116
C  2.925883 1.335244 1.868913
C  1.631219 1.745596 -0.232051
C  3.824803 -0.813923 2.454405
C  3.624126 0.526396 2.751903
H  -3.407306 0.02244 -2.569648
H  -1.421602 -0.134964 -1.922798
H  0.485105 -1.536785 -1.989631
H  -5.788784 1.738225 -1.725344
H  -5.485726 1.099028 -3.340656
H  -5.809908 -0.008784 -2.011514
H  -2.051827 2.125075 -2.154329
H  -3.555196 3.000865 -1.855769
H  -3.21939 2.325615 -3.450827
H  -3.3892 0.193361 1.884205
H  0.521602 -1.527413 1.627566
H  3.471498 -2.375025 1.034756
H  -1.412905 -0.813025 2.956424
H  2.797779 2.386208 2.099187
H  0.555114 1.698804 -0.050488
H  1.936118 2.780146 -0.077159
H  1.795377 1.512961 -1.284154
H  4.380925 -1.450221 3.130085
H  4.024137 0.947109 3.665584
elementType: O N C H
totalener: -864.56034874 hartree
nucrepener: 1510.66646006 hartree
electener: -2375.22680880 hartree
oneelecener: -4172.98506978 hartree
twoeener: 1797.75826099 hartree
cpcmener: -0.02809463 hartree
kineticenergy: 860.71146188 hartree
xcener: -84.971990259515 hartree
chargesum: 0.0000000
charge: -0.330663 -0.477156 -0.124670 0.156157 0.323460 0.045187 -0.021888 -0.168559 -0.000285 -0.258318 -0.262021 0.334751 -0.268033 -0.239840 -0.168373 -0.105581 -0.159198 -0.233648 -0.178184 -0.137768 0.067449 0.120738 0.168100 0.090166 0.089804 0.096813 0.094542 0.091124 0.096806 0.139388 0.153604 0.140244 0.156235 0.136340 0.101084 0.104237 0.109470 0.158719 0.159765
qa: -0.3307 -0.4772 -0.1247 0.1562 0.3235 0.0452 -0.0219 -0.1686 -0.0003 -0.2583 -0.2620 0.3348 -0.2680 -0.2398 -0.1684 -0.1056 -0.1592 -0.2336 -0.1782 -0.1378 0.0674 0.1207 0.1681 0.0902 0.0898 0.0968 0.0945 0.0911 0.0968 0.1394 0.1536 0.1402 0.1562 0.1363 0.1011 0.1042 0.1095 0.1587 0.1598
va: 2.0931 2.0335 3.1475 3.8190 3.8053 3.7799 3.5162 3.8365 3.6968 3.9269 3.9005 4.2244 3.9993 3.9539 3.9586 3.9073 3.9269 3.9126 3.9115 3.8924 1.0004 1.0246 1.0208 1.0073 1.0053 1.0086 1.0043 1.0078 1.0075 1.0122 0.9972 1.0099 0.9890 1.0014 0.9955 1.0042 1.0010 0.9903 0.9885
dispcorr: -0.018912363 hartree
energy: -864.579261103138
dipole: -14.55992 12.98087 -1.57905 11.32112 -10.34931 0.97181 -5.78895 5.92693 0.13798
magnitude: 1.85926 au
magnitude: 4.72586 debye
