program: Orca
programVersion: 4.2.1
elementType: O O N C C C C C C C C C C C C C C C C C H H H H H H H H H H H H H H H H H H H
charge: 0
multiplicity: 1
keywords: wb97x-d3
keywords: def2-TZVPP
keywords: def2/J RIJCOSX GRIDX6 NOFINALGRIDX
keywords: grid4 nofinalgrid
keywords: scfconv7
keywords: smallprint printgap noloewdin
keywords: NOSOSCF
formula: C17H19NO2
InChI: InChI=1/C17H19NO2/c1-12(2)20-15-9-6-8-14(11-15)18-17(19)16-10-5-4-7-13(16)3/h4-12,18H,1-3H3
39 atoms
O  -4.14023 0.154844 -0.474411
O  1.96394 -2.208097 0.501071
N  0.568613 -0.425921 0.217172
C  -4.054724 1.57133 -0.42852
C  -3.038097 -0.61285 -0.385567
C  -0.675284 -1.015304 -0.031685
C  2.893297 -0.031214 0.653981
C  -1.759045 -0.135905 -0.132232
C  3.203864 0.989475 -0.251151
C  -3.554181 2.134076 -1.750922
C  -5.447203 2.070788 -0.093748
C  1.780661 -1.014355 0.437273
C  -3.235161 -1.984573 -0.547499
C  -0.869871 -2.382155 -0.189086
C  3.663395 -0.210696 1.800233
C  -2.156763 -2.838499 -0.446085
C  4.273574 1.829343 0.05234
C  2.462603 1.193812 -1.545811
C  4.70972 0.645084 2.091505
C  5.012788 1.673688 1.212212
H  -3.379875 1.876761 0.381754
H  -1.579971 0.924122 -0.000211
H  0.554796 0.577241 0.297458
H  -2.570354 1.749978 -2.020496
H  -4.243292 1.882971 -2.558091
H  -3.483067 3.220888 -1.695156
H  -5.448294 3.15805 -0.0185
H  -5.792579 1.6664 0.857092
H  -6.161477 1.785901 -0.866996
H  -4.230439 -2.359274 -0.744506
H  -0.050987 -3.076462 -0.111277
H  3.430835 -1.029754 2.468105
H  -2.315076 -3.901851 -0.56973
H  4.538046 2.614414 -0.645886
H  1.582059 1.829461 -1.424038
H  3.104034 1.688952 -2.273623
H  2.126975 0.258134 -1.989671
H  5.291248 0.504129 2.992574
H  5.835046 2.34554 1.420603
totalener: -864.54090895 hartree
nucrepener: 1457.03886629 hartree
electener: -2321.57977525 hartree
oneelecener: -4065.30327541 hartree
twoeener: 1743.72350017 hartree
kineticenergy: 860.73055801 hartree
xcener: -84.969846268621 hartree
chargesum: -0.0000000
charge: -0.290919 -0.382111 -0.157867 0.126685 0.291650 0.136635 0.039969 -0.205719 -0.104223 -0.251641 -0.238316 0.383468 -0.242660 -0.218228 -0.158502 -0.070058 -0.099455 -0.249213 -0.138583 -0.120549 0.050763 0.069591 0.138475 0.090671 0.090576 0.085489 0.077357 0.095199 0.087470 0.115446 0.146975 0.127807 0.121742 0.108480 0.083378 0.090832 0.112690 0.128375 0.128322
qa: -0.2909 -0.3821 -0.1579 0.1267 0.2917 0.1366 0.0400 -0.2057 -0.1042 -0.2516 -0.2383 0.3835 -0.2427 -0.2182 -0.1585 -0.0701 -0.0995 -0.2492 -0.1386 -0.1205 0.0508 0.0696 0.1385 0.0907 0.0906 0.0855 0.0774 0.0952 0.0875 0.1154 0.1470 0.1278 0.1217 0.1085 0.0834 0.0908 0.1127 0.1284 0.1283
va: 2.1290 2.1244 3.2392 3.8785 3.9373 3.9518 3.6380 3.8673 3.7977 3.8964 3.9350 4.0462 4.0397 4.0289 4.0205 3.9450 3.9371 3.9601 3.9603 3.9755 0.9988 1.0313 1.0303 1.0084 1.0102 1.0091 1.0066 1.0112 1.0104 1.0181 1.0393 1.0192 0.9996 1.0070 0.9934 1.0071 0.9986 1.0012 0.9991
dispcorr: -0.016222536 hartree
energy: -864.557131487304
dipole: -11.95109 11.77555 -0.17553 14.73579 -12.83271 1.90308 -6.24722 6.09635 -0.15087
magnitude: 1.91710 au
magnitude: 4.87289 debye
