program: Orca
programVersion: 4.2.1
elementType: O O N C C C C C C C C C C C C C C C C C H H H H H H H H H H H H H H H H H H H
charge: 0
multiplicity: 1
keywords: wb97x-d3
keywords: def2-TZVPP
keywords: def2/J RIJCOSX GRIDX6 NOFINALGRIDX
keywords: grid4 nofinalgrid
keywords: scfconv7
keywords: smallprint printgap noloewdin
keywords: NOSOSCF
formula: C17H19NO2
InChI: InChI=1/C17H19NO2/c1-12(2)20-15-9-6-8-14(11-15)18-17(19)16-10-5-4-7-13(16)3/h4-12,18H,1-3H3
39 atoms
O  -4.259147 0.025818 -0.212248
O  2.05918 -1.910242 -0.376023
N  0.510887 -0.319398 0.15094
C  -4.25787 1.431667 -0.014774
C  -3.109165 -0.671014 -0.275801
C  -0.708682 -0.951831 -0.113599
C  2.827544 0.182876 0.453817
C  -1.847139 -0.141086 -0.043221
C  3.952339 0.419465 -0.346878
C  -3.877052 2.167125 -1.291459
C  -5.655917 1.796047 0.447328
C  1.78299 -0.804081 0.028797
C  -3.234986 -2.025633 -0.584716
C  -0.831852 -2.30123 -0.422054
C  2.693541 0.825137 1.682117
C  -2.103535 -2.811534 -0.650731
C  4.900414 1.325668 0.117256
C  4.157273 -0.254849 -1.672482
C  3.659876 1.709119 2.133708
C  4.765652 1.963755 1.340866
H  -3.555075 1.693538 0.786836
H  -1.723068 0.907941 0.19625
H  0.441999 0.654016 0.397712
H  -2.891417 1.883301 -1.660121
H  -4.600295 1.960081 -2.081153
H  -3.868607 3.243681 -1.117559
H  -5.720454 2.866401 0.64221
H  -5.918131 1.269508 1.364369
H  -6.396119 1.547312 -0.314024
H  -4.217477 -2.440117 -0.765409
H  0.031559 -2.940405 -0.489221
H  1.839418 0.607459 2.312618
H  -2.205851 -3.861906 -0.890095
H  5.767985 1.533695 -0.497048
H  4.98458 0.206863 -2.209865
H  4.381668 -1.31318 -1.547627
H  3.273671 -0.192877 -2.307831
H  3.549742 2.189628 3.096494
H  5.527581 2.656644 1.672937
totalener: -864.54312196 hartree
nucrepener: 1447.87976629 hartree
electener: -2312.42288826 hartree
oneelecener: -4047.14011815 hartree
twoeener: 1734.71722989 hartree
kineticenergy: 860.73149523 hartree
xcener: -84.970414028767 hartree
chargesum: 0.0000000
charge: -0.291163 -0.391873 -0.162793 0.128062 0.288780 0.129330 0.025561 -0.202146 -0.076462 -0.250376 -0.239245 0.394163 -0.241801 -0.209798 -0.233108 -0.072645 -0.078478 -0.220796 -0.129036 -0.126490 0.048987 0.073603 0.137531 0.091957 0.090199 0.084961 0.077239 0.095300 0.087789 0.115467 0.145960 0.135894 0.121776 0.108836 0.075793 0.117133 0.096037 0.127824 0.128029
qa: -0.2912 -0.3919 -0.1628 0.1281 0.2888 0.1293 0.0256 -0.2021 -0.0765 -0.2504 -0.2392 0.3942 -0.2418 -0.2098 -0.2331 -0.0726 -0.0785 -0.2208 -0.1290 -0.1265 0.0490 0.0736 0.1375 0.0920 0.0902 0.0850 0.0772 0.0953 0.0878 0.1155 0.1460 0.1359 0.1218 0.1088 0.0758 0.1171 0.0960 0.1278 0.1280
va: 2.1288 2.1083 3.2356 3.8767 3.9382 3.9744 3.5837 3.8636 3.9149 3.8972 3.9340 4.0399 4.0386 4.0194 4.0002 3.9438 3.8929 3.9348 3.9821 3.9849 0.9991 1.0291 1.0337 1.0081 1.0098 1.0094 1.0067 1.0111 1.0104 1.0181 1.0381 1.0175 0.9997 1.0075 1.0049 1.0041 0.9995 1.0020 0.9992
dispcorr: -0.015758556 hartree
energy: -864.558880520652
dipole: -10.49460 10.28776 -0.20685 11.65206 -9.95001 1.70206 -3.12342 3.43017 0.30675
magnitude: 1.74180 au
magnitude: 4.42731 debye
