program: Orca
programVersion: 4.2.1
elementType: O O N C C C C C C C C C C C C C C C C C H H H H H H H H H H H H H H H H H H H
charge: 0
multiplicity: 1
keywords: wb97x-d3
keywords: def2-TZVPP
keywords: def2/J RIJCOSX GRIDX6 NOFINALGRIDX
keywords: grid4 nofinalgrid
keywords: scfconv7
keywords: smallprint printgap noloewdin
keywords: NOSOSCF
formula: C17H19NO2
InChI: InChI=1/C17H19NO2/c1-12(2)20-15-9-6-8-14(11-15)18-17(19)16-10-5-4-7-13(16)3/h4-12,18H,1-3H3
39 atoms
O  -3.966164 -0.015959 -0.951288
O  0.805798 1.200487 -0.820528
N  0.675751 -0.790214 0.287865
C  -3.744896 1.300679 -1.443753
C  -2.967442 -0.732431 -0.408037
C  -0.675619 -1.142191 0.202232
C  2.783909 0.340103 0.16653
C  -1.638908 -0.316086 -0.375398
C  3.265087 0.238064 1.476293
C  -4.919921 1.61349 -2.349499
C  -3.626673 2.301014 -0.304255
C  1.322388 0.319406 -0.169712
C  -3.333038 -1.967619 0.127622
C  -1.039555 -2.374499 0.738473
C  3.666481 0.521772 -0.89449
C  -2.364745 -2.773725 0.691695
C  4.643639 0.287547 1.671724
C  2.360714 0.117542 2.673895
C  5.032623 0.550638 -0.680441
C  5.522136 0.428808 0.611159
H  -2.829958 1.321589 -2.048161
H  -1.335232 0.62743 -0.795152
H  1.260609 -1.478392 0.732428
H  -4.803411 2.606246 -2.78386
H  -4.991844 0.895455 -3.165928
H  -5.858831 1.596944 -1.79456
H  -3.458158 3.302259 -0.701708
H  -2.798389 2.071915 0.365677
H  -4.544336 2.321378 0.285268
H  -4.368061 -2.27886 0.089952
H  -0.294933 -3.01989 1.18921
H  3.272296 0.63525 -1.895913
H  -2.644886 -3.733182 1.106058
H  5.033341 0.225967 2.680691
H  2.075429 -0.916934 2.879017
H  2.865823 0.483341 3.566789
H  1.441071 0.689574 2.562403
H  5.709951 0.677227 -1.514212
H  6.587938 0.45944 0.795521
totalener: -864.54292395 hartree
nucrepener: 1466.93878716 hartree
electener: -2331.48171111 hartree
oneelecener: -4085.37247435 hartree
twoeener: 1753.89076325 hartree
kineticenergy: 860.73641811 hartree
xcener: -84.971851097137 hartree
chargesum: -0.0000000
charge: -0.290696 -0.394189 -0.147389 0.129113 0.295712 0.129595 0.056788 -0.210356 -0.115430 -0.240030 -0.249825 0.381622 -0.252982 -0.237276 -0.166258 -0.064691 -0.095152 -0.243948 -0.135801 -0.121458 0.059189 0.146804 0.140798 0.078329 0.093823 0.084924 0.085480 0.097444 0.084476 0.115296 0.088937 0.125604 0.119995 0.109389 0.085703 0.090002 0.110217 0.128185 0.128055
qa: -0.2907 -0.3942 -0.1474 0.1291 0.2957 0.1296 0.0568 -0.2104 -0.1154 -0.2400 -0.2498 0.3816 -0.2530 -0.2373 -0.1663 -0.0647 -0.0952 -0.2439 -0.1358 -0.1215 0.0592 0.1468 0.1408 0.0783 0.0938 0.0849 0.0855 0.0974 0.0845 0.1153 0.0889 0.1256 0.1200 0.1094 0.0857 0.0900 0.1102 0.1282 0.1281
va: 2.1303 2.1156 3.2443 3.8744 3.8915 3.9481 3.6239 3.8730 3.8162 3.9259 3.9013 4.0380 4.0567 4.0156 4.0249 3.9902 3.9344 3.9613 3.9574 3.9765 1.0010 1.0435 1.0275 1.0071 1.0108 1.0101 1.0104 1.0096 1.0087 1.0190 1.0193 1.0194 0.9991 1.0066 0.9945 1.0073 0.9984 1.0013 0.9994
dispcorr: -0.016424318 hartree
energy: -864.559348265930
dipole: -9.16749 9.86742 0.69993 6.16803 -6.55427 -0.38624 1.56029 -0.93334 0.62695
magnitude: 1.01595 au
magnitude: 2.58233 debye
