program: Orca
programVersion: 4.2.1
elementType: F F O N N N C C C C C C C C C C C C C C C C C C C C H H H H H H H H H H H H H H H H H H H H H H H
charge: 0
multiplicity: 1
keywords: wb97x-d3
keywords: def2-TZVPP
keywords: def2/J RIJCOSX GRIDX6 NOFINALGRIDX
keywords: grid4 nofinalgrid
keywords: scfconv7
keywords: smallprint printgap noloewdin
keywords: NOSOSCF
formula: C20H23F2N3O
InChI: InChI=1/C20H23F2N3O/c1-10(2)16-12-7-8-13(16)17-11(12)5-4-6-15(17)23-20(26)14-9-25(3)24-18(14)19(21)22/h4-6,9-10,12-13,16,19,23H,7-8H2,1-3H3
49 atoms
F  2.407671 0.040472 -2.699671
F  3.376094 1.981694 -2.459558
O  0.870135 -0.854329 1.845388
N  0.540474 -0.878027 -0.39881
N  4.731586 0.344408 0.858924
N  4.479171 0.879324 -0.329446
C  -3.290444 0.968545 0.829788
C  -1.905348 0.401134 1.221738
C  -4.004069 -0.39333 0.996238
C  -2.223413 -0.173711 2.623955
C  -3.66576 -0.714471 2.469905
C  -1.817194 -0.775916 0.286446
C  -3.120928 -1.270503 0.152018
C  -3.39932 1.648734 -0.531518
C  -0.78009 -1.372598 -0.407792
C  -3.408551 -2.352541 -0.652696
C  -2.499118 2.878587 -0.593946
C  -4.844259 2.037446 -0.826792
C  -1.068212 -2.463359 -1.236915
C  -2.360454 -2.943742 -1.358869
C  1.278816 -0.642952 0.713442
C  2.633275 -0.11979 0.481968
C  3.215551 0.60857 -0.578257
C  3.663037 -0.253845 1.390766
C  2.576559 1.092602 -1.831711
C  6.048561 0.443857 1.451666
H  -3.637158 1.677426 1.592848
H  -1.068026 1.09522 1.206224
H  -5.066507 -0.43711 0.761462
H  -2.177686 0.621711 3.369487
H  -1.509686 -0.939287 2.919915
H  -3.746406 -1.780138 2.686044
H  -4.358647 -0.196163 3.134689
H  -3.071896 0.9512 -1.309873
H  -4.420903 -2.722188 -0.758111
H  -2.756815 3.595887 0.189584
H  -1.445005 2.624012 -0.47346
H  -2.599972 3.390432 -1.552721
H  -4.922743 2.554874 -1.784713
H  -5.502949 1.169148 -0.874081
H  -5.237106 2.708784 -0.058802
H  -0.267472 -2.92917 -1.798841
H  -2.553814 -3.782659 -2.014505
H  1.036338 -0.966307 -1.272275
H  3.69749 -0.738552 2.352904
H  1.599851 1.549586 -1.671046
H  5.995695 0.968722 2.402239
H  6.466315 -0.547092 1.611061
H  6.691264 0.996424 0.775047
elementType: F O N C H
totalener: -1215.28962996 hartree
nucrepener: 2419.70644412 hartree
electener: -3634.99607409 hartree
oneelecener: -6468.24663562 hartree
twoeener: 2833.25056153 hartree
cpcmener: -0.03440979 hartree
kineticenergy: 1210.18795125 hartree
xcener: -115.780699634609 hartree
chargesum: -0.0000000
charge: -0.220984 -0.204719 -0.516888 -0.196652 0.113891 -0.311344 -0.149087 0.243791 0.239005 -0.225165 -0.200213 -0.214244 -0.179088 -0.002336 0.116417 -0.201784 -0.296185 -0.297344 -0.227800 -0.129441 0.390784 -0.110614 0.023237 -0.037849 0.244146 -0.153448 0.082005 0.097934 0.085178 0.089300 0.084628 0.083224 0.088784 0.040411 0.147505 0.086395 0.086275 0.092789 0.091637 0.091916 0.084937 0.140331 0.160037 0.191933 0.180573 0.126461 0.129167 0.130385 0.112107
qa: -0.2210 -0.2047 -0.5169 -0.1967 0.1139 -0.3113 -0.1491 0.2438 0.2390 -0.2252 -0.2002 -0.2142 -0.1791 -0.0023 0.1164 -0.2018 -0.2962 -0.2973 -0.2278 -0.1294 0.3908 -0.1106 0.0232 -0.0378 0.2441 -0.1534 0.0820 0.0979 0.0852 0.0893 0.0846 0.0832 0.0888 0.0404 0.1475 0.0864 0.0863 0.0928 0.0916 0.0919 0.0849 0.1403 0.1600 0.1919 0.1806 0.1265 0.1292 0.1304 0.1121
va: 1.0298 1.0788 1.9935 3.2136 3.4160 2.9603 4.0913 3.5296 3.5953 3.9403 3.9446 3.7135 3.6887 3.8346 3.7259 3.9656 3.9182 3.9164 3.9880 3.8862 4.1203 3.5527 3.9075 4.0344 4.2380 3.8650 1.0013 1.0008 1.0006 1.0051 1.0333 1.0120 1.0085 1.0159 1.0001 1.0034 1.0054 1.0053 1.0054 1.0037 1.0030 1.0073 0.9889 1.0194 0.9991 0.9782 0.9880 0.9874 1.0084
dispcorr: -0.025642669 hartree
energy: -1215.315272631942
dipole: -32.55297 33.13769 0.58472 6.55759 -6.48997 0.06763 13.76298 -13.13448 0.62850
magnitude: 0.86109 au
magnitude: 2.18872 debye
