program: Orca
programVersion: 4.2.1
elementType: F F O N N N C C C C C C C C C C C C C C C C C C C C H H H H H H H H H H H H H H H H H H H H H H H
charge: 0
multiplicity: 1
keywords: wb97x-d3
keywords: def2-TZVPP
keywords: def2/J RIJCOSX GRIDX6 NOFINALGRIDX
keywords: grid4 nofinalgrid
keywords: scfconv7
keywords: smallprint printgap noloewdin
keywords: NOSOSCF
formula: C20H23F2N3O
InChI: InChI=1/C20H23F2N3O/c1-10(2)16-12-7-8-13(16)17-11(12)5-4-6-15(17)23-20(26)14-9-25(3)24-18(14)19(21)22/h4-6,9-10,12-13,16,19,23H,7-8H2,1-3H3
49 atoms
F  2.019657 2.041621 1.97568
F  3.637052 2.766869 0.695269
O  2.343113 -1.002594 2.374021
N  0.555624 -2.020984 1.476689
N  2.041432 0.249564 -1.89009
N  2.658927 1.185578 -1.175374
C  -2.307798 1.028241 -0.101915
C  -1.572663 0.26865 1.030586
C  -3.409527 -0.04234 -0.242574
C  -2.707978 0.155036 2.076592
C  -3.968526 -0.063673 1.202281
C  -1.449682 -1.102753 0.418974
C  -2.580743 -1.28872 -0.382722
C  -1.48725 1.364118 -1.343459
C  -0.546313 -2.134699 0.593557
C  -2.813173 -2.484255 -1.031096
C  -0.528822 2.511372 -1.040542
C  -2.378596 1.72692 -2.525792
C  -0.766294 -3.342209 -0.074385
C  -1.882776 -3.512535 -0.877785
C  1.580591 -1.146353 1.421049
C  1.806101 -0.395635 0.180536
C  2.537179 0.805756 0.075999
C  1.502035 -0.70872 -1.12964
C  3.064873 1.640937 1.189473
C  1.904202 0.386889 -3.323191
H  -2.739539 1.960151 0.284323
H  -0.65491 0.714152 1.412114
H  -4.168356 0.112189 -1.007586
H  -2.78051 1.080104 2.650275
H  -2.533928 -0.65407 2.786086
H  -4.487059 -0.995781 1.427272
H  -4.685948 0.747376 1.335595
H  -0.895794 0.486394 -1.625729
H  -3.695936 -2.629458 -1.641345
H  0.099936 2.307716 -0.173844
H  0.13283 2.712571 -1.8848
H  -1.082196 3.431243 -0.833875
H  -1.779301 2.048068 -3.380182
H  -2.987016 0.88483 -2.857678
H  -3.055592 2.547194 -2.273866
H  -0.053596 -4.149093 0.039338
H  -2.03201 -4.455807 -1.386633
H  0.52443 -2.592673 2.310755
H  0.97752 -1.542343 -1.567253
H  3.789574 1.133186 1.822377
H  2.504863 1.229176 -3.649423
H  2.251824 -0.513211 -3.824232
H  0.864548 0.564913 -3.592888
elementType: F O N C H
totalener: -1215.28806220 hartree
nucrepener: 2567.12522852 hartree
electener: -3782.41329072 hartree
oneelecener: -6762.57207531 hartree
twoeener: 2980.15878458 hartree
cpcmener: -0.03775973 hartree
kineticenergy: 1210.19876627 hartree
xcener: -115.787012016675 hartree
chargesum: 0.0000000
charge: -0.219318 -0.216027 -0.535220 -0.133126 0.125517 -0.291212 -0.094289 0.223178 0.205425 -0.210011 -0.191388 -0.134678 -0.202422 -0.038891 0.018019 -0.186015 -0.301566 -0.305098 -0.206738 -0.119158 0.331920 -0.042359 -0.058879 -0.093847 0.311573 -0.148126 0.086403 0.084672 0.091017 0.091764 0.083539 0.080606 0.089813 0.039918 0.147676 0.077352 0.090718 0.102627 0.091617 0.090724 0.096805 0.146220 0.160690 0.177558 0.195159 0.118403 0.116709 0.135937 0.116812
qa: -0.2193 -0.2160 -0.5352 -0.1331 0.1255 -0.2912 -0.0943 0.2232 0.2054 -0.2100 -0.1914 -0.1347 -0.2024 -0.0389 0.0180 -0.1860 -0.3016 -0.3051 -0.2067 -0.1192 0.3319 -0.0424 -0.0589 -0.0938 0.3116 -0.1481 0.0864 0.0847 0.0910 0.0918 0.0835 0.0806 0.0898 0.0399 0.1477 0.0774 0.0907 0.1026 0.0916 0.0907 0.0968 0.1462 0.1607 0.1776 0.1952 0.1184 0.1167 0.1359 0.1168
va: 1.0380 1.0625 1.9723 3.1799 3.3724 2.9254 4.0449 3.5834 3.6687 3.9879 3.9522 3.5690 3.7256 3.8610 3.6586 3.9624 3.8963 3.9242 3.9766 3.8611 4.2523 3.3862 3.9675 4.0206 4.1958 3.8577 0.9996 0.9997 0.9971 1.0061 1.0125 1.0123 1.0086 1.0110 0.9994 1.0177 1.0072 1.0091 1.0054 1.0016 1.0017 1.0086 0.9876 1.0131 0.9808 0.9950 1.0078 0.9916 0.9862
dispcorr: -0.031732094 hartree
energy: -1215.319794292074
dipole: -30.00634 27.67940 -2.32694 -0.07225 -1.83612 -1.90837 -17.33652 14.81090 -2.52562
magnitude: 3.92878 au
magnitude: 9.98616 debye
