program: Gaussian 09
title: 000069411
version: EM64L-G09RevD.01
frameworkgroup: C1[X(C8H14O5)]
method: RPBEPBE
basis: SDD
operation: Freq
keyword: #pfreq=noraman
keyword: PBEPBE/SDD
title: #p freq=noraman PBEPBE/SDD
converged: YES YES NO NO
title: Mulliken charges:
elementType: O O O O O C C C C C C C C H H H H H H H H H H H H H H
charge: -0.263476 -0.256312 -0.256413 -0.251226 -0.251212 -0.246319 -0.246290 -0.268676 -0.268671 0.297513 0.297592 -0.750322 -0.750326 0.191025 0.202096 0.191001 0.202127 0.219498 0.251643 0.219310 0.251803 0.251893 0.246173 0.244756 0.251896 0.246158 0.244759
chargesum: 0.00000
title: Mulliken charges with hydrogens summed into heavy atoms:
elementType: O O O O O C C C C C C C C
charge: -0.263476 -0.256312 -0.256413 -0.251226 -0.251212 0.146802 0.146839 0.202466 0.202441 0.297513 0.297592 -0.007501 -0.007513
polarizability: 1.20552010e+02 -9.75486559e-04 9.28314592e+01 3.53513515e-01 1.94231652e-02 1.00289425e+02
1716.lowfreq: -0.0009 -0.0007 -0.0006 2.5419 4.8917 14.6040 15.8767 26.5983 26.7133
frequency: 14.5884 26.5800 26.6939 31.1712 48.8501 49.7028 67.1135 122.6608 138.5534 180.6537 180.9584 201.2536 216.1523 273.8824 296.3078 399.8835 407.5305 461.0124 488.6127 565.1510 565.9124 608.5093 617.4573 779.3538 790.1289 792.0182 904.9081 920.7304 932.0708 988.6448 992.7413 1022.1131 1027.1187 1042.0896 1043.9950 1044.9488 1071.2495 1114.3207 1118.0332 1198.9386 1202.2698 1204.0281 1208.7983 1252.0808 1252.1617 1341.9191 1359.0961 1369.1775 1384.1951 1384.6554 1418.0593 1452.4422 1452.4892 1454.3626 1454.3923 1455.7820 1456.6555 1457.1116 1473.0342 1648.3441 1648.9625 2924.7958 2932.5851 2978.4348 2983.2207 3006.4020 3006.4275 3019.9256 3020.0350 3088.4074 3088.5277 3099.8972 3099.9486 3140.2502 3140.2855
redmass: 6.0821 5.8876 4.3263 3.7225 1.0565 1.0707 4.0524 4.0128 5.2656 4.4637 3.6289 3.6665 2.3656 2.5315 2.8570 2.9783 2.8584 2.6075 3.4170 3.1309 3.0520 4.6422 4.2779 2.3267 3.3854 3.3693 3.3212 5.2998 2.8364 1.7062 1.7010 2.5241 2.9637 2.2756 1.6675 1.8402 2.7484 2.1147 3.0213 1.0834 2.7418 1.2250 3.7385 1.1077 1.1037 1.2356 1.3382 1.4600 1.2497 1.2719 1.5919 1.0664 1.0668 1.0657 1.0668 1.0730 1.0610 1.0742 1.0806 9.6192 9.6262 1.0566 1.0565 1.1019 1.1031 1.0382 1.0382 1.0601 1.0603 1.1060 1.1060 1.0943 1.0943 1.1023 1.1023
irintensity: 0.5725 0.9289 2.5241 1.1015 0.1981 0.3607 0.3286 16.1522 1.2596 4.7829 3.6455 7.3473 11.5426 2.1317 4.5169 6.8926 0.1569 17.5903 3.4317 1.7177 4.2976 8.3271 0.2532 9.6826 0.0248 17.9160 9.1534 22.6632 101.2517 17.3611 25.3553 15.8889 141.4136 5.6510 2.7836 46.6744 67.3796 8.2154 39.0251 2.9926 438.3660 24.9653 260.2437 7.0938 3.2620 22.7139 0.0000 9.1518 23.7642 76.9932 0.0377 3.4647 8.5890 17.3654 35.3121 34.9971 17.4163 7.1706 8.3869 332.1869 81.2871 35.4201 92.5585 78.8283 4.9076 2.0878 1.8428 44.1228 14.7195 20.1944 20.6354 10.9584 8.8329 11.0509 8.4619
temp: 298.150 k
press: 1.00000 atm
elementType: 8 8 8 8 8 6 6 6 6 6 6 6 6 1 1 1 1 1 1 1 1 1 1 1 1 1 1
symmnumber: 1
zpe: 566023.6 jmol-1
zpe.correction: 0.215587 hartree
zpe.thermalcorrener: 0.231628 hartree
zpe.thermalcorrenthalpy: 0.232572 hartree
zpe.thermalcorrgfe: 0.166715 hartree
zpe.sumelectzpe: -688.311022 hartree
zpe.sumelectthermal: -688.294982 hartree
zpe.sumelectthermalent: -688.294037 hartree
zpe.sumelectthermalfe: -688.359894 hartree
dipole: 0.0055 3.3452 -0.0011
dipole: 3.3452
quadrupole: -84.8812 -72.1167 -76.9756
quadrupole: 0.0415 17.8605 -0.0362
quadrupole: -6.8900 5.8744 1.0155 0.0415 17.8605 -0.0362
hfenergy: -688.5266094 hartree
pointgroup: C01 [X(C8H14O5)]
dipole: -0.001985 -1.3160957 -0.0002682 debye
polarizability: 120.4470847|0.0017744|92.8314574|-1.496665|-0.0191941|100.3943516 unknown
InChI: InChI=1S/C8H14O5/c1-7(9)12-5-3-11-4-6-13-8(2)10/h3-6H2,1-2H3
charge 0 multiplicity 1
27 atoms
O  -0.001374 -0.768944 -0.000203
O  2.906139 -0.200751 -0.382482
O  -2.910092 -0.206887 0.381838
O  4.323514 1.136988 0.894017
O  -4.315688 1.14503 -0.892769
C  1.112833 -1.581296 0.491275
C  -1.113829 -1.583684 -0.491636
C  2.244073 -0.645287 0.875365
C  -2.246968 -0.650027 -0.875933
C  3.941571 0.728587 -0.226301
C  -3.939177 0.729654 0.226813
C  4.478515 1.160478 -1.57309
C  -4.476843 1.159454 1.573995
H  0.795998 -2.160179 1.388073
H  1.456724 -2.297986 -0.28633
H  -0.795806 -2.162092 -1.388318
H  -1.456272 -2.30095 0.286082
H  2.993054 -1.15505 1.508544
H  1.86122 0.236127 1.418471
H  -2.994905 -1.161697 -1.508842
H  -1.866153 0.232053 -1.419349
H  3.858415 1.987986 -1.963841
H  4.434665 0.334571 -2.299997
H  5.51104 1.523758 -1.46097
H  -3.853007 1.981964 1.969326
H  -4.439426 0.330548 2.297834
H  -5.50702 1.529031 1.460829
