program: Orca
programVersion: 4.2.1
elementType: F F O N N N C C C C C C C C C C C C C C C C C C C C H H H H H H H H H H H H H H H H H H H H H H H
charge: 0
multiplicity: 1
keywords: wb97x-d3
keywords: def2-TZVPP
keywords: def2/J RIJCOSX GRIDX6 NOFINALGRIDX
keywords: grid4 nofinalgrid
keywords: scfconv7
keywords: smallprint printgap noloewdin
keywords: NOSOSCF
formula: C20H23F2N3O
InChI: InChI=1/C20H23F2N3O/c1-10(2)16-12-7-8-13(16)17-11(12)5-4-6-15(17)23-20(26)14-9-25(3)24-18(14)19(21)22/h4-6,9-10,12-13,16,19,23H,7-8H2,1-3H3
49 atoms
F  1.719152 1.834273 -1.808283
F  2.413926 -0.010121 -2.738377
O  0.953023 -0.920275 1.741748
N  0.59186 -0.863451 -0.492167
N  4.767345 0.399991 0.871179
N  4.570258 0.883278 -0.347417
C  -3.177517 0.988042 0.879261
C  -1.801628 0.375735 1.226574
C  -3.91954 -0.364076 0.997021
C  -2.114387 -0.254601 2.606517
C  -3.570771 -0.756182 2.450533
C  -1.750115 -0.758972 0.239215
C  -3.064839 -1.222958 0.104715
C  -3.299304 1.72371 -0.452233
C  -0.734325 -1.340118 -0.498523
C  -3.383156 -2.266044 -0.739217
C  -2.280085 2.854089 -0.550752
C  -4.71394 2.266221 -0.628756
C  -1.05453 -2.38866 -1.369022
C  -2.356431 -2.844101 -1.486719
C  1.343473 -0.660165 0.611972
C  2.695499 -0.115892 0.399189
C  3.326327 0.581274 -0.657521
C  3.678613 -0.196707 1.364018
C  2.818701 1.050538 -1.968784
C  6.0428 0.555527 1.537607
H  -3.494189 1.672744 1.676637
H  -0.951669 1.054021 1.231828
H  -4.985157 -0.373886 0.771876
H  -2.040966 0.505576 3.385864
H  -1.414424 -1.048151 2.858284
H  -3.672857 -1.828121 2.621635
H  -4.242564 -0.251822 3.146815
H  -3.101605 1.022853 -1.270323
H  -4.403059 -2.61466 -0.843468
H  -1.254106 2.481934 -0.561952
H  -2.422935 3.431031 -1.466344
H  -2.371652 3.546452 0.290222
H  -5.463353 1.473367 -0.60666
H  -4.963628 2.977443 0.162787
H  -4.820536 2.786802 -1.582105
H  -0.271405 -2.842253 -1.964606
H  -2.574642 -3.651636 -2.173267
H  1.055816 -0.858561 -1.386652
H  3.665977 -0.642495 2.345294
H  3.57562 1.601988 -2.524821
H  5.926387 1.149518 2.440731
H  6.453063 -0.416961 1.797579
H  6.72591 1.06178 0.864322
elementType: F O N C H
totalener: -1215.29200124 hartree
nucrepener: 2443.72734587 hartree
electener: -3659.01934711 hartree
oneelecener: -6517.19226440 hartree
twoeener: 2858.17291730 hartree
cpcmener: -0.03191563 hartree
kineticenergy: 1210.19324594 hartree
xcener: -115.781297092801 hartree
chargesum: 0.0000000
charge: -0.211400 -0.228712 -0.521998 -0.180117 0.108811 -0.301719 -0.148267 0.250865 0.239746 -0.225822 -0.202409 -0.212413 -0.189399 -0.000822 0.116396 -0.197681 -0.297567 -0.294638 -0.232614 -0.132391 0.372200 -0.128329 -0.019524 -0.030580 0.327394 -0.152183 0.082338 0.097440 0.085563 0.089060 0.084325 0.083162 0.088941 0.041256 0.147693 0.078174 0.092401 0.089436 0.092216 0.082233 0.091716 0.141575 0.159905 0.192179 0.176896 0.124346 0.129715 0.130063 0.112540
qa: -0.2114 -0.2287 -0.5220 -0.1801 0.1088 -0.3017 -0.1483 0.2509 0.2397 -0.2258 -0.2024 -0.2124 -0.1894 -0.0008 0.1164 -0.1977 -0.2976 -0.2946 -0.2326 -0.1324 0.3722 -0.1283 -0.0195 -0.0306 0.3274 -0.1522 0.0823 0.0974 0.0856 0.0891 0.0843 0.0832 0.0889 0.0413 0.1477 0.0782 0.0924 0.0894 0.0922 0.0822 0.0917 0.1416 0.1599 0.1922 0.1769 0.1243 0.1297 0.1301 0.1125
va: 1.0632 1.0467 1.9896 3.2108 3.4145 2.9602 4.0910 3.5294 3.5914 3.9421 3.9445 3.7167 3.6940 3.8347 3.7256 3.9630 3.9207 3.9150 3.9913 3.8926 4.1545 3.6097 4.0662 4.0446 4.1631 3.8647 1.0005 0.9998 1.0010 1.0051 1.0331 1.0122 1.0083 1.0159 0.9997 1.0115 1.0058 1.0030 1.0043 1.0034 1.0052 1.0080 0.9889 1.0306 1.0018 0.9972 0.9875 0.9878 1.0080
dispcorr: -0.025957380 hartree
energy: -1215.317958616392
dipole: -27.23792 29.00061 1.76269 7.74761 -7.41783 0.32978 12.88017 -12.69630 0.18387
magnitude: 1.80268 au
magnitude: 4.58204 debye
